program: Orca
programVersion: 5.0.3
elementType: Cl Cl Cl S P O O O N C C C C C C C C C H H H H H H H H H H H
charge: 0
multiplicity: 1
keywords: wb97x-d3
keywords: def2-TZVPP
keywords: def2/J RIJCOSX
keywords: DEFGRID2
keywords: scfconv7
keywords: smallprint printgap noloewdin
keywords: NOSOSCF
formula: C9H11Cl3NO3PS
InChI: InChI=1/C9H11Cl3NO3PS/c1-3-14-17(18,15-4-2)16-9-7(11)5-6(10)8(12)13-9/h5H,3-4H2,1-2H3
29 atoms
Cl -0.915139 -1.540164 2.048603
Cl -4.615383 0.854869 -1.024073
Cl -2.346895 2.796797 -2.041257
S  1.363849 -1.753933 -1.069761
P  1.96869 -0.573299 0.310064
O  2.335347 -1.151955 1.737889
O  3.238508 0.324139 -0.012046
O  0.855628 0.525796 0.801281
N  -0.75778 1.456327 -0.491353
C  3.223873 -2.280749 1.898449
C  3.613705 0.734846 -1.344324
C  -0.430664 0.5314 0.376945
C  2.824641 -3.021905 3.146833
C  2.748895 1.852263 -1.867325
C  -1.364897 -0.36329 0.89024
C  -2.673048 -0.267966 0.457446
C  -3.005172 0.709866 -0.46388
C  -1.997311 1.557225 -0.906305
H  3.157484 -2.93284 1.024865
H  4.245153 -1.904791 1.966058
H  4.650278 1.052683 -1.249625
H  3.585036 -0.131305 -2.007353
H  1.813515 -3.420726 3.067197
H  3.505398 -3.859919 3.294706
H  2.883186 -2.384894 4.029221
H  1.725358 1.526388 -2.050335
H  2.731465 2.701171 -1.184507
H  3.158936 2.194488 -2.817721
H  -3.427477 -0.945549 0.833468
elementType: Cl S P O N C H
totalener: -2750.37635706 hartree
nucrepener: 2161.44001082 hartree
electener: -4911.81636788 hartree
oneelecener: -8092.96095791 hartree
twoeener: 3181.14459002 hartree
cpcmener: -0.01832959 hartree
kineticenergy: 2744.35681059 hartree
xcener: -158.741136618162 hartree
chargesum: -0.0000000
charge: -0.041995 -0.040314 -0.045461 -0.426480 0.730718 -0.328561 -0.345289 -0.327955 -0.278056 0.041280 0.040930 0.333109 -0.240283 -0.238161 -0.027685 -0.026849 -0.040370 0.185095 0.087566 0.109680 0.111638 0.095513 0.082183 0.094443 0.091848 0.069805 0.093151 0.101419 0.139082
qa: -0.0420 -0.0403 -0.0455 -0.4265 0.7307 -0.3286 -0.3453 -0.3280 -0.2781 0.0413 0.0409 0.3331 -0.2403 -0.2382 -0.0277 -0.0268 -0.0404 0.1851 0.0876 0.1097 0.1116 0.0955 0.0822 0.0944 0.0918 0.0698 0.0932 0.1014 0.1391
va: 1.2745 1.2719 1.2736 1.9928 5.5078 2.1204 2.1149 2.1113 3.0547 3.8379 3.8458 4.0469 3.9490 3.9002 4.0665 3.9911 4.0484 4.1645 1.0060 0.9958 0.9927 1.0111 1.0060 1.0082 1.0030 1.0208 1.0060 1.0102 1.0079
dispcorr: -0.015615680 hartree
energy: -2750.391972742646
dipole: 35.45111 -34.67225 0.77886 -9.89770 9.20734 -0.69036 5.69351 -5.06383 0.62968
magnitude: 1.21644 au
magnitude: 3.09194 debye
