program: Orca
programVersion: 5.0.3
elementType: Cl Cl Cl S P O O O N C C C C C C C C C H H H H H H H H H H H
charge: 0
multiplicity: 1
keywords: wb97x-d3
keywords: def2-TZVPP
keywords: def2/J RIJCOSX
keywords: DEFGRID2
keywords: scfconv7
keywords: smallprint printgap noloewdin
keywords: NOSOSCF
formula: C9H11Cl3NO3PS
InChI: InChI=1/C9H11Cl3NO3PS/c1-3-14-17(18,15-4-2)16-9-7(11)5-6(10)8(12)13-9/h5H,3-4H2,1-2H3
29 atoms
Cl -1.281799 1.173068 3.058284
Cl -4.283693 1.731796 -1.380927
Cl -1.877033 0.479121 -3.00897
S  1.254028 -2.550842 -0.143239
P  1.804391 -0.810565 0.432982
O  2.885471 -0.740982 1.592189
O  2.377283 0.219018 -0.62434
O  0.641144 0.10625 1.145111
N  -0.661316 0.327096 -0.728374
C  2.991536 -1.751006 2.624362
C  3.134693 -0.198841 -1.786056
C  -0.513105 0.468836 0.563329
C  4.108677 -2.710994 2.309096
C  2.268673 -0.201888 -3.019266
C  -1.516156 1.00512 1.369512
C  -2.692582 1.400091 0.767676
C  -2.837302 1.245937 -0.603583
C  -1.778396 0.695856 -1.308899
H  3.184485 -1.205329 3.546433
H  2.042184 -2.276256 2.741658
H  3.945187 0.522444 -1.872911
H  3.580199 -1.180233 -1.615777
H  4.205297 -3.427382 3.125401
H  3.909226 -3.268952 1.39458
H  5.062002 -2.193563 2.203401
H  1.490779 -0.962166 -2.964995
H  1.802772 0.769301 -3.185019
H  2.893456 -0.423631 -3.884682
H  -3.494627 1.823953 1.356563
elementType: Cl S P O N C H
totalener: -2750.37699048 hartree
nucrepener: 2142.90870251 hartree
electener: -4893.28569299 hartree
oneelecener: -8055.97929141 hartree
twoeener: 3162.69359842 hartree
cpcmener: -0.01857512 hartree
kineticenergy: 2744.35596895 hartree
xcener: -158.741753304443 hartree
chargesum: 0.0000000
charge: -0.047515 -0.046287 -0.046450 -0.435203 0.769967 -0.352215 -0.339669 -0.307834 -0.302750 0.045651 0.051417 0.412642 -0.233938 -0.241299 -0.076154 -0.011780 -0.042755 0.143029 0.108753 0.088694 0.110065 0.092124 0.096282 0.074403 0.090845 0.071517 0.086175 0.104643 0.137642
qa: -0.0475 -0.0463 -0.0465 -0.4352 0.7700 -0.3522 -0.3397 -0.3078 -0.3027 0.0457 0.0514 0.4126 -0.2339 -0.2413 -0.0762 -0.0118 -0.0428 0.1430 0.1088 0.0887 0.1101 0.0921 0.0963 0.0744 0.0908 0.0715 0.0862 0.1046 0.1376
va: 1.2610 1.2661 1.2744 1.9795 5.4820 2.1108 2.0999 2.1962 3.0335 3.8463 3.8430 3.9767 3.9234 3.9089 4.0239 3.9637 4.0424 4.2304 0.9966 1.0116 0.9966 1.0073 1.0078 1.0194 1.0036 1.0203 1.0065 1.0114 1.0095
dispcorr: -0.015407938 hartree
energy: -2750.392398417264
dipole: 35.51877 -34.88137 0.63740 -14.81660 15.29160 0.47499 2.26959 -1.50000 0.76959
magnitude: 1.10642 au
magnitude: 2.81230 debye
