program: Orca
programVersion: 5.0.3
elementType: Cl Cl Cl S P O O O N C C C C C C C C C H H H H H H H H H H H
charge: 0
multiplicity: 1
keywords: wb97x-d3
keywords: def2-TZVPP
keywords: def2/J RIJCOSX
keywords: DEFGRID2
keywords: scfconv7
keywords: smallprint printgap noloewdin
keywords: NOSOSCF
formula: C9H11Cl3NO3PS
InChI: InChI=1/C9H11Cl3NO3PS/c1-3-14-17(18,15-4-2)16-9-7(11)5-6(10)8(12)13-9/h5H,3-4H2,1-2H3
29 atoms
Cl -1.563068 -2.300961 -1.508559
Cl -4.42914 1.524562 0.967204
Cl -1.737625 3.162209 1.275051
S  3.375053 -1.197054 -1.455277
P  2.011193 -0.630712 -0.242545
O  1.566253 -1.592067 0.935825
O  2.243802 0.694648 0.594067
O  0.620938 -0.386429 -1.080947
N  -0.614014 1.18177 0.042351
C  2.060937 -2.938391 1.110024
C  2.565693 1.952468 -0.043418
C  -0.552821 0.016006 -0.550427
C  1.263705 -3.937829 0.314699
C  4.03154 2.263291 0.11557
C  -1.678784 -0.78642 -0.716915
C  -2.891054 -0.320027 -0.247125
C  -2.941092 0.914282 0.38023
C  -1.755696 1.627365 0.504572
H  3.118957 -2.975674 0.846232
H  1.975608 -3.127944 2.178888
H  2.281579 1.938951 -1.097928
H  1.945362 2.698209 0.45066
H  1.369684 -3.780859 -0.758648
H  1.632303 -4.93937 0.541363
H  0.205966 -3.905922 0.574101
H  4.230351 3.25535 -0.292036
H  4.327241 2.269529 1.164762
H  4.655829 1.548858 -0.420515
H  -3.790338 -0.909841 -0.364198
elementType: Cl S P O N C H
totalener: -2750.38636048 hartree
nucrepener: 2156.87958255 hartree
electener: -4907.26594303 hartree
oneelecener: -8083.18733888 hartree
twoeener: 3175.92139586 hartree
cpcmener: -0.01572848 hartree
kineticenergy: 2744.35268965 hartree
xcener: -158.739408173389 hartree
chargesum: -0.0000000
charge: -0.045332 -0.040874 -0.045518 -0.416493 0.718576 -0.333907 -0.326631 -0.321108 -0.273861 0.050517 0.047727 0.360594 -0.245211 -0.237357 -0.043193 -0.023495 -0.045991 0.164901 0.092619 0.110180 0.096791 0.094072 0.081259 0.103467 0.081184 0.094361 0.088977 0.076521 0.137226
qa: -0.0453 -0.0409 -0.0455 -0.4165 0.7186 -0.3339 -0.3266 -0.3211 -0.2739 0.0505 0.0477 0.3606 -0.2452 -0.2374 -0.0432 -0.0235 -0.0460 0.1649 0.0926 0.1102 0.0968 0.0941 0.0813 0.1035 0.0812 0.0944 0.0890 0.0765 0.1372
va: 1.2610 1.2705 1.2738 2.0217 5.5275 2.1052 2.1110 2.1221 3.0634 3.8264 3.8442 4.0188 3.9095 3.9653 4.0396 3.9830 4.0514 4.1960 1.0128 0.9928 0.9991 1.0042 1.0159 1.0119 1.0093 1.0068 1.0037 1.0174 1.0090
dispcorr: -0.016188048 hartree
energy: -2750.402548527023
dipole: 29.41459 -30.39438 -0.97979 -10.05766 9.63739 -0.42026 2.03920 -1.36481 0.67440
magnitude: 1.26152 au
magnitude: 3.20652 debye
