program: Orca
programVersion: 5.0.3
elementType: Cl Cl Cl S P O O O N C C C C C C C C C H H H H H H H H H H H
charge: 0
multiplicity: 1
keywords: wb97x-d3
keywords: def2-TZVPP
keywords: def2/J RIJCOSX
keywords: DEFGRID2
keywords: scfconv7
keywords: smallprint printgap noloewdin
keywords: NOSOSCF
formula: C9H11Cl3NO3PS
InChI: InChI=1/C9H11Cl3NO3PS/c1-3-14-17(18,15-4-2)16-9-7(11)5-6(10)8(12)13-9/h5H,3-4H2,1-2H3
29 atoms
Cl -0.350285 3.103403 1.127751
Cl -4.862911 0.456988 -0.167101
Cl -3.048178 -2.055451 -0.814474
S  1.710355 -0.702116 -2.184636
P  1.898932 -0.52776 -0.293095
O  1.706875 -1.869859 0.511651
O  3.253927 0.055933 0.287719
O  0.872391 0.563177 0.408662
N  -1.052491 -0.552801 -0.131144
C  1.851968 -1.997138 1.94821
C  3.96069 1.157453 -0.327764
C  -0.458892 0.542012 0.272557
C  3.145114 -2.692827 2.286198
C  5.110141 0.64902 -1.159101
C  -1.170936 1.698915 0.587149
C  -2.543119 1.674508 0.455484
C  -3.160283 0.513045 0.013334
C  -2.356619 -0.582039 -0.267611
H  1.788456 -1.022694 2.435293
H  0.993411 -2.58334 2.273388
H  3.278633 1.764466 -0.92686
H  4.311579 1.774852 0.498191
H  3.192041 -2.846924 3.364983
H  3.210604 -3.670287 1.807919
H  4.013851 -2.10258 1.99557
H  5.676281 1.498431 -1.543445
H  5.79013 0.034921 -0.567906
H  4.761468 0.064913 -2.010448
H  -3.132743 2.550907 0.688778
elementType: Cl S P O N C H
totalener: -2750.38950473 hartree
nucrepener: 2134.19085676 hartree
electener: -4884.58036148 hartree
oneelecener: -8038.13952142 hartree
twoeener: 3153.55915994 hartree
cpcmener: -0.01953409 hartree
kineticenergy: 2744.34975764 hartree
xcener: -158.738463880178 hartree
chargesum: -0.0000000
charge: -0.047388 -0.044903 -0.043160 -0.409518 0.720816 -0.332601 -0.324193 -0.309446 -0.296238 0.040335 0.028514 0.443221 -0.246279 -0.230922 -0.078293 -0.021051 -0.055118 0.134638 0.101416 0.106848 0.091695 0.108273 0.093576 0.090432 0.084058 0.094283 0.088969 0.076947 0.135087
qa: -0.0474 -0.0449 -0.0432 -0.4095 0.7208 -0.3326 -0.3242 -0.3094 -0.2962 0.0403 0.0285 0.4432 -0.2463 -0.2309 -0.0783 -0.0211 -0.0551 0.1346 0.1014 0.1068 0.0917 0.1083 0.0936 0.0904 0.0841 0.0943 0.0890 0.0769 0.1351
va: 1.2619 1.2677 1.2774 2.0333 5.5232 2.1208 2.0998 2.1402 2.9974 3.8465 3.8574 3.8859 3.9420 3.9280 4.0572 3.9745 4.0288 4.2604 0.9999 0.9938 1.0061 0.9954 1.0073 1.0031 1.0128 1.0081 1.0039 1.0204 1.0110
dispcorr: -0.015096749 hartree
energy: -2750.404601475362
dipole: 41.42683 -40.72184 0.70498 -5.70958 7.01116 1.30158 7.70653 -5.62721 2.07931
magnitude: 2.55238 au
magnitude: 6.48764 debye
