program: Orca
programVersion: 5.0.3
elementType: Cl Cl Cl S P O O O N C C C C C C C C C H H H H H H H H H H H
charge: 0
multiplicity: 1
keywords: wb97x-d3
keywords: def2-TZVPP
keywords: def2/J RIJCOSX
keywords: DEFGRID2
keywords: scfconv7
keywords: smallprint printgap noloewdin
keywords: NOSOSCF
formula: C9H11Cl3NO3PS
InChI: InChI=1/C9H11Cl3NO3PS/c1-3-14-17(18,15-4-2)16-9-7(11)5-6(10)8(12)13-9/h5H,3-4H2,1-2H3
29 atoms
Cl -0.240799 3.421875 -0.090647
Cl -4.539726 0.223347 0.4937
Cl -2.576574 -2.247777 0.166099
S  1.836359 -1.292411 -2.360377
P  2.142063 -0.404899 -0.696678
O  2.109271 -1.273421 0.630469
O  3.515377 0.373619 -0.643214
O  1.127528 0.856495 -0.355507
N  -0.707349 -0.478979 -0.094961
C  1.527936 -2.591821 0.740496
C  3.886421 1.452029 0.247877
C  -0.186852 0.72007 -0.155062
C  0.914859 -2.731638 2.109286
C  3.963488 1.048074 1.69901
C  -0.963378 1.870125 -0.013492
C  -2.317867 1.717887 0.192647
C  -2.858494 0.440131 0.248956
C  -1.995051 -0.634458 0.101053
H  0.781722 -2.741092 -0.03864
H  2.327813 -3.317251 0.587687
H  4.865137 1.762844 -0.11309
H  3.201951 2.288681 0.105003
H  1.655492 -2.605253 2.899396
H  0.113011 -2.010107 2.265704
H  0.490004 -3.730995 2.208393
H  4.387752 1.880732 2.260965
H  2.986797 0.830669 2.129085
H  4.613406 0.185285 1.843406
H  -2.954649 2.584861 0.307527
elementType: Cl S P O N C H
totalener: -2750.38796632 hartree
nucrepener: 2175.38211152 hartree
electener: -4925.77007784 hartree
oneelecener: -8119.99143886 hartree
twoeener: 3194.22136102 hartree
cpcmener: -0.01688492 hartree
kineticenergy: 2744.34524993 hartree
xcener: -158.742264550799 hartree
chargesum: 0.0000000
charge: -0.046416 -0.044988 -0.044116 -0.416972 0.710411 -0.315280 -0.340240 -0.303883 -0.317711 0.045221 0.040518 0.432518 -0.251994 -0.246700 -0.079112 -0.019707 -0.042350 0.149673 0.088024 0.119612 0.110091 0.092281 0.097293 0.076728 0.094728 0.099661 0.083329 0.092319 0.137062
qa: -0.0464 -0.0450 -0.0441 -0.4170 0.7104 -0.3153 -0.3402 -0.3039 -0.3177 0.0452 0.0405 0.4325 -0.2520 -0.2467 -0.0791 -0.0197 -0.0424 0.1497 0.0880 0.1196 0.1101 0.0923 0.0973 0.0767 0.0947 0.0997 0.0833 0.0923 0.1371
va: 1.2614 1.2679 1.2766 2.0252 5.5142 2.0796 2.1507 2.1522 3.0176 3.7936 3.8672 3.9380 3.9409 3.9203 4.0373 3.9640 4.0495 4.2105 1.0210 1.0001 0.9871 1.0014 1.0051 1.0094 1.0066 1.0089 1.0108 1.0059 1.0096
dispcorr: -0.016930747 hartree
energy: -2750.404897071840
dipole: 28.94641 -29.09887 -0.15247 -6.03093 7.13022 1.09929 13.60047 -11.47373 2.12675
magnitude: 2.39890 au
magnitude: 6.09752 debye
