program: Orca
programVersion: 5.0.3
elementType: Cl Cl Cl S P O O O N C C C C C C C C C H H H H H H H H H H H
charge: 0
multiplicity: 1
keywords: wb97x-d3
keywords: def2-TZVPP
keywords: def2/J RIJCOSX
keywords: DEFGRID2
keywords: scfconv7
keywords: smallprint printgap noloewdin
keywords: NOSOSCF
formula: C9H11Cl3NO3PS
InChI: InChI=1/C9H11Cl3NO3PS/c1-3-14-17(18,15-4-2)16-9-7(11)5-6(10)8(12)13-9/h5H,3-4H2,1-2H3
29 atoms
Cl -0.507606 3.480924 -0.00209
Cl -4.65291 0.071097 0.478784
Cl -2.568058 -2.299437 0.152716
S  1.761528 -1.025842 -2.388412
P  2.054798 -0.213537 -0.686215
O  2.075191 -1.125714 0.610611
O  3.384288 0.633962 -0.605719
O  0.98801 0.987872 -0.283317
N  -0.78277 -0.438637 -0.064264
C  1.58967 -2.484392 0.676736
C  3.922054 1.212993 0.609852
C  -0.320089 0.78522 -0.10223
C  0.992342 -2.712288 2.040198
C  5.090029 0.401963 1.108292
C  -1.153508 1.894569 0.044215
C  -2.501645 1.673674 0.228814
C  -2.980395 0.370752 0.261291
C  -2.063768 -0.658804 0.11258
H  0.853296 -2.657922 -0.1071
H  2.438284 -3.146053 0.49861
H  4.233683 2.220275 0.335859
H  3.150384 1.306515 1.375887
H  0.141073 -2.05577 2.219591
H  0.641759 -3.742631 2.106979
H  1.724506 -2.558049 2.833398
H  5.527862 0.905383 1.971269
H  4.788375 -0.5971 1.421962
H  5.865849 0.310968 0.347795
H  -3.18153 2.506984 0.345799
elementType: Cl S P O N C H
totalener: -2750.38969955 hartree
nucrepener: 2159.59538605 hartree
electener: -4909.98508561 hartree
oneelecener: -8088.54676109 hartree
twoeener: 3178.56167548 hartree
cpcmener: -0.01711766 hartree
kineticenergy: 2744.34613202 hartree
xcener: -158.740240910167 hartree
chargesum: -0.0000000
charge: -0.046087 -0.045450 -0.045049 -0.412292 0.712561 -0.322055 -0.341182 -0.304905 -0.318273 0.044798 0.048139 0.434639 -0.249555 -0.245423 -0.081363 -0.017318 -0.043922 0.149869 0.092421 0.120057 0.105202 0.097090 0.076530 0.093558 0.096654 0.093382 0.082703 0.089504 0.135767
qa: -0.0461 -0.0455 -0.0450 -0.4123 0.7126 -0.3221 -0.3412 -0.3049 -0.3183 0.0448 0.0481 0.4346 -0.2496 -0.2454 -0.0814 -0.0173 -0.0439 0.1499 0.0924 0.1201 0.1052 0.0971 0.0765 0.0936 0.0967 0.0934 0.0827 0.0895 0.1358
va: 1.2623 1.2672 1.2753 2.0266 5.5181 2.0690 2.1346 2.1585 3.0156 3.7853 3.8488 3.9498 3.9456 3.9361 4.0306 3.9615 4.0485 4.2116 1.0213 0.9999 0.9936 1.0000 1.0099 1.0065 1.0047 1.0076 1.0105 1.0037 1.0104
dispcorr: -0.016337750 hartree
energy: -2750.406037302144
dipole: 33.20987 -33.14855 0.06132 -8.57548 9.16961 0.59413 12.47520 -10.20732 2.26788
magnitude: 2.34522 au
magnitude: 5.96107 debye
