program: Orca
programVersion: 5.0.3
elementType: Cl Cl Cl S P O O O N C C C C C C C C C H H H H H H H H H H H
charge: 0
multiplicity: 1
keywords: wb97x-d3
keywords: def2-TZVPP
keywords: def2/J RIJCOSX
keywords: DEFGRID2
keywords: scfconv7
keywords: smallprint printgap noloewdin
keywords: NOSOSCF
formula: C9H11Cl3NO3PS
InChI: InChI=1/C9H11Cl3NO3PS/c1-3-14-17(18,15-4-2)16-9-7(11)5-6(10)8(12)13-9/h5H,3-4H2,1-2H3
29 atoms
Cl -1.607413 -1.890886 -1.90717
Cl -4.204216 1.50937 1.354004
Cl -1.464367 3.052259 1.724583
S  3.357473 -1.102129 -1.80358
P  1.921301 -0.806524 -0.593117
O  1.186166 -2.05529 0.06565
O  2.199611 0.085989 0.695994
O  0.653825 -0.077026 -1.33111
N  -0.475321 1.296454 0.096705
C  1.868242 -3.29298 0.3100
C  2.841587 1.365804 0.580876
C  -0.482222 0.241025 -0.679616
C  2.835876 -3.199252 1.467363
C  2.694756 2.082692 1.899523
C  -1.632937 -0.516237 -0.890984
C  -2.79629 -0.116515 -0.261764
C  -2.777082 0.998338 0.561202
C  -1.569627 1.672428 0.710669
H  1.075593 -4.010145 0.518297
H  2.381126 -3.608955 -0.601225
H  3.890934 1.209659 0.320575
H  2.377087 1.947718 -0.218277
H  2.345448 -2.830849 2.367561
H  3.24029 -4.188637 1.682613
H  3.675645 -2.544187 1.235944
H  3.199929 3.047027 1.847006
H  1.645875 2.263971 2.130101
H  3.140953 1.514319 2.715232
H  -3.712887 -0.671702 -0.404046
totalener: -2750.37071606 hartree
nucrepener: 2168.47066900 hartree
electener: -4918.84138506 hartree
oneelecener: -8106.04106755 hartree
twoeener: 3187.19968249 hartree
kineticenergy: 2744.39179057 hartree
xcener: -158.744621992396 hartree
chargesum: 0.0000000
charge: -0.028027 -0.028963 -0.033451 -0.348229 0.675087 -0.308284 -0.297630 -0.307016 -0.260082 0.002603 0.004625 0.344391 -0.219269 -0.226333 -0.055770 -0.057741 -0.048858 0.168360 0.092996 0.094890 0.110126 0.106721 0.089193 0.084472 0.082447 0.076657 0.082056 0.083345 0.121683
qa: -0.0280 -0.0290 -0.0335 -0.3482 0.6751 -0.3083 -0.2976 -0.3070 -0.2601 0.0026 0.0046 0.3444 -0.2193 -0.2263 -0.0558 -0.0577 -0.0489 0.1684 0.0930 0.0949 0.1101 0.1067 0.0892 0.0845 0.0824 0.0767 0.0821 0.0833 0.1217
va: 1.2812 1.2833 1.2856 2.1023 5.5416 2.1140 2.0957 2.1678 3.0693 3.9128 3.8429 4.0724 3.8850 3.9608 4.0618 3.9797 4.0549 4.1777 0.9923 1.0101 1.0074 0.9961 1.0067 1.0116 1.0223 1.0093 1.0143 1.0064 1.0186
dispcorr: -0.016166320 hartree
energy: -2750.386882375127
dipole: 29.79385 -30.30147 -0.50762 -10.28171 9.86594 -0.41576 9.66756 -8.78928 0.87828
magnitude: 1.09632 au
magnitude: 2.78663 debye
