program: Orca
programVersion: 5.0.3
elementType: Cl Cl Cl S P O O O N C C C C C C C C C H H H H H H H H H H H
charge: 0
multiplicity: 1
keywords: wb97x-d3
keywords: def2-TZVPP
keywords: def2/J RIJCOSX
keywords: DEFGRID2
keywords: scfconv7
keywords: smallprint printgap noloewdin
keywords: NOSOSCF
formula: C9H11Cl3NO3PS
InChI: InChI=1/C9H11Cl3NO3PS/c1-3-14-17(18,15-4-2)16-9-7(11)5-6(10)8(12)13-9/h5H,3-4H2,1-2H3
29 atoms
Cl -0.808492 3.478146 0.583185
Cl -4.893912 -0.002165 0.155267
Cl -2.73385 -2.325621 0.060523
S  1.693022 -0.38694 -1.987299
P  1.88819 -0.05653 -0.118372
O  1.849814 -1.265784 0.899632
O  3.194323 0.682383 0.388698
O  0.773178 1.013234 0.486434
N  -0.978522 -0.436354 0.278496
C  1.416491 -2.588225 0.533475
C  3.82542 1.71899 -0.377652
C  -0.539039 0.793033 0.396882
C  0.776916 -3.233751 1.736158
C  5.061024 1.183698 -1.060128
C  -1.410329 1.882611 0.444685
C  -2.764852 1.631555 0.373303
C  -3.217107 0.325499 0.248515
C  -2.263825 -0.682775 0.203827
H  0.713413 -2.539184 -0.297972
H  2.293043 -3.147869 0.201838
H  3.132502 2.135914 -1.111617
H  4.071026 2.506586 0.334004
H  0.478953 -4.250897 1.481137
H  1.463988 -3.286854 2.579902
H  -0.114921 -2.690512 2.04367
H  4.799747 0.424276 -1.795728
H  5.576405 1.993418 -1.576951
H  5.753552 0.749972 -0.33974
H  -3.471942 2.448562 0.407028
totalener: -2750.37320742 hartree
nucrepener: 2156.20346592 hartree
electener: -4906.57667334 hartree
oneelecener: -8081.67489215 hartree
twoeener: 3175.09821881 hartree
kineticenergy: 2744.40437407 hartree
xcener: -158.750589174528 hartree
chargesum: -0.0000000
charge: -0.033820 -0.032748 -0.033548 -0.378833 0.712234 -0.308775 -0.308673 -0.297938 -0.301410 0.037583 0.022490 0.392939 -0.233683 -0.220167 -0.068985 -0.049350 -0.048891 0.157516 0.093272 0.107329 0.081353 0.095297 0.080058 0.091744 0.075100 0.082973 0.080179 0.086369 0.120386
qa: -0.0338 -0.0327 -0.0335 -0.3788 0.7122 -0.3088 -0.3087 -0.2979 -0.3014 0.0376 0.0225 0.3929 -0.2337 -0.2202 -0.0690 -0.0493 -0.0489 0.1575 0.0933 0.1073 0.0814 0.0953 0.0801 0.0917 0.0751 0.0830 0.0802 0.0864 0.1204
va: 1.2755 1.2799 1.2877 2.0384 5.5241 2.1330 2.1498 2.1780 3.0245 3.8231 3.9022 3.9966 3.9433 3.9204 4.0307 3.9677 4.0595 4.1998 1.0152 1.0000 1.0111 0.9952 1.0074 1.0072 1.0161 1.0216 1.0110 1.0050 1.0193
dispcorr: -0.015840426 hartree
energy: -2750.389047848579
dipole: 33.94139 -33.82288 0.11851 -7.31202 7.66300 0.35098 0.53558 -0.10366 0.43191
magnitude: 0.56902 au
magnitude: 1.44633 debye
