program: Orca
programVersion: 5.0.3
elementType: Cl Cl Cl S P O O O N C C C C C C C C C H H H H H H H H H H H
charge: 0
multiplicity: 1
keywords: wb97x-d3
keywords: def2-TZVPP
keywords: def2/J RIJCOSX
keywords: DEFGRID2
keywords: scfconv7
keywords: smallprint printgap noloewdin
keywords: NOSOSCF
formula: C9H11Cl3NO3PS
InChI: InChI=1/C9H11Cl3NO3PS/c1-3-14-17(18,15-4-2)16-9-7(11)5-6(10)8(12)13-9/h5H,3-4H2,1-2H3
29 atoms
Cl -0.21506 3.364605 0.264137
Cl -4.634907 0.321105 -0.188213
Cl -2.7422 -2.217942 -0.077697
S  2.105286 -1.216349 -1.690998
P  2.15339 -0.461634 0.060158
O  1.89634 -1.385595 1.319979
O  3.484636 0.301455 0.475551
O  1.08929 0.761141 0.350113
N  -0.796713 -0.520888 0.133955
C  2.032939 -2.816826 1.269919
C  4.291565 1.011248 -0.472579
C  -0.235418 0.658545 0.212294
C  0.710223 -3.490476 0.99613
C  3.645067 2.289752 -0.956679
C  -0.982809 1.837396 0.168203
C  -2.352318 1.729298 0.046233
C  -2.937033 0.473322 -0.03506
C  -2.097514 -0.632195 0.012964
H  2.770296 -3.099693 0.51526
H  2.428387 -3.098144 2.245531
H  5.217975 1.221812 0.059961
H  4.525002 0.353627 -1.313212
H  0.841183 -4.571703 1.056799
H  -0.04497 -3.198741 1.724248
H  0.340222 -3.246475 0.00256
H  4.363392 2.846146 -1.559545
H  2.775435 2.091652 -1.582509
H  3.336622 2.923328 -0.126105
H  -2.967748 2.617262 0.010249
totalener: -2750.37211748 hartree
nucrepener: 2170.74065678 hartree
electener: -4921.11277426 hartree
oneelecener: -8110.89193416 hartree
twoeener: 3189.77915991 hartree
kineticenergy: 2744.40036296 hartree
xcener: -158.751834756267 hartree
chargesum: 0.0000000
charge: -0.037588 -0.034171 -0.032099 -0.375945 0.714381 -0.309182 -0.311575 -0.293298 -0.275948 0.028286 0.010017 0.398715 -0.222362 -0.228391 -0.072417 -0.052767 -0.044366 0.142941 0.082607 0.096368 0.095132 0.092377 0.088720 0.080214 0.083897 0.086597 0.080874 0.088132 0.120851
qa: -0.0376 -0.0342 -0.0321 -0.3759 0.7144 -0.3092 -0.3116 -0.2933 -0.2759 0.0283 0.0100 0.3987 -0.2224 -0.2284 -0.0724 -0.0528 -0.0444 0.1429 0.0826 0.0964 0.0951 0.0924 0.0887 0.0802 0.0839 0.0866 0.0809 0.0881 0.1209
va: 1.2716 1.2785 1.2895 2.0425 5.5140 2.1339 2.1489 2.1875 3.0575 3.8814 3.9042 3.9648 3.8910 3.8773 4.0345 3.9754 4.0497 4.2177 1.0119 0.9941 0.9915 1.0108 1.0138 1.0099 1.0215 1.0124 1.0229 1.0092 1.0187
dispcorr: -0.016574448 hartree
energy: -2750.388691928982
dipole: 30.33019 -30.02667 0.30352 -6.27614 6.71595 0.43981 1.00337 -0.60212 0.40125
magnitude: 0.66825 au
magnitude: 1.69856 debye
