program: Orca
programVersion: 5.0.4
elementType: Cl S S P O O C C C C C H H H H H H H H H H H H
charge: 0
multiplicity: 1
keywords: wb97x-d3
keywords: def2-TZVPP
keywords: def2/J RIJCOSX
keywords: DEFGRID2
keywords: scfconv7
keywords: smallprint printgap noloewdin
keywords: NOSOSCF
formula: C5H12ClO2PS2
InChI: InChI=1/C5H12ClO2PS2/c1-3-7-9(10,8-4-2)11-5-6/h3-5H2,1-2H3
23 atoms
Cl -2.868551 0.418223 -1.315057
S  -0.887292 1.04443 0.852939
S  1.610745 -0.804063 1.809391
P  0.671307 -0.212486 0.2422
O  0.020851 -1.301289 -0.725073
O  1.490144 0.562658 -0.885723
C  -0.861291 -2.31977 -0.201266
C  2.630556 1.395565 -0.583924
C  -0.122507 -3.619866 -0.013273
C  2.255799 2.688414 0.095897
C  -1.62076 1.54632 -0.717633
H  -1.318824 -1.986815 0.733421
H  -1.658102 -2.421605 -0.935528
H  3.339865 0.825271 0.018206
H  3.087295 1.585799 -1.553271
H  -0.828009 -4.38484 0.312349
H  0.330643 -3.958575 -0.94491
H  0.655976 -3.535842 0.743966
H  1.499891 3.2360 -0.467192
H  1.891757 2.532218 1.110921
H  3.146163 3.314909 0.158481
H  -2.099713 2.507063 -0.546308
H  -0.867526 1.667435 -1.490212
elementType: Cl S P O C H
totalener: -1946.32674316 hartree
nucrepener: 1169.56972160 hartree
electener: -3115.89646476 hartree
oneelecener: -5011.36322500 hartree
twoeener: 1895.46676024 hartree
cpcmener: -0.01754791 hartree
kineticenergy: 1941.99192490 hartree
xcener: -109.902643434838 hartree
chargesum: 0.0000000
charge: -0.148412 -0.116003 -0.439468 0.624954 -0.344452 -0.344893 0.044754 0.042664 -0.241158 -0.255035 -0.095137 0.092021 0.100939 0.097705 0.113466 0.095398 0.090134 0.075930 0.094011 0.080031 0.106041 0.173504 0.153004
qa: -0.1484 -0.1160 -0.4395 0.6250 -0.3445 -0.3449 0.0448 0.0427 -0.2412 -0.2550 -0.0951 0.0920 0.1009 0.0977 0.1135 0.0954 0.0901 0.0759 0.0940 0.0800 0.1060 0.1735 0.1530
va: 1.1222 2.3143 2.0236 5.4658 2.0894 2.0989 3.8408 3.8253 3.9686 3.9032 4.0168 1.0048 0.9979 1.0123 0.9919 1.0064 1.0038 1.0194 1.0037 1.0131 1.0108 0.9901 1.0193
dispcorr: -0.010848302 hartree
energy: -1946.337591458047
dipole: 9.94495 -10.01641 -0.07146 -0.96223 2.04851 1.08627 -1.25546 0.29032 -0.96514
magnitude: 1.45485 au
magnitude: 3.69794 debye
