program: Gaussian 09
title: 000065289
version: EM64L-G09RevD.01
frameworkgroup: C1[X(C10H16O)]
method: RPBEPBE
basis: SDD
operation: Freq
keyword: #pfreq=noraman
keyword: PBEPBE/SDD
title: #p freq=noraman PBEPBE/SDD
converged: YES YES NO NO
title: Mulliken charges:
elementType: O C C C C C C C C C C H H H H H H H H H H H H H H H H
charge: -0.203861 0.246962 -0.462423 -0.476442 -0.524213 -0.750791 0.434603 -0.385630 0.175452 -0.820758 -0.788330 0.214115 0.202117 0.249662 0.204956 0.209001 0.207853 0.222981 0.209062 0.235756 0.205219 0.228648 0.216632 0.219333 0.232662 0.241410 0.256022
chargesum: 0.00000
title: Mulliken charges with hydrogens summed into heavy atoms:
elementType: O C C C C C C C C C C
charge: -0.203861 0.246962 -0.046192 -0.021823 -0.107359 -0.082992 0.434603 -0.180411 0.175452 -0.156144 -0.058236
polarizability: 1.12968665e+02 -5.85383603e+00 1.04081827e+02 1.25342351e+00 7.40252707e+00 9.74678410e+01
1716.lowfreq: -16.0772 -6.1827 0.0004 0.0005 0.0009 14.6356 54.6150 62.1874 127.0641
frequency: 54.4157 62.1045 127.0210 152.6940 178.8123 210.8295 223.1289 254.6061 272.6082 291.5879 321.7329 354.8441 385.9440 426.2395 444.7394 516.7545 539.5658 589.4851 636.8553 681.0377 753.0530 800.8991 819.4573 889.7424 923.3516 945.0575 957.5189 976.2780 986.5898 1008.9818 1038.8601 1044.9956 1064.1980 1094.7203 1109.8196 1161.9319 1167.3371 1174.6104 1211.4605 1255.7026 1286.0417 1316.3538 1328.0508 1339.8059 1365.6617 1368.9855 1385.8785 1393.8333 1438.9223 1445.4133 1455.4574 1460.5138 1463.7182 1469.3617 1472.4151 1476.3904 1478.0421 1617.1223 1702.7657 2944.0810 2955.5809 2956.7058 2973.6681 2977.8219 2987.1481 2997.9661 3024.3072 3024.7013 3036.5358 3069.2712 3073.9737 3077.0083 3078.4907 3096.5586 3119.5403
redmass: 6.5169 2.9360 1.0204 1.5774 1.7730 1.6476 1.3911 2.3699 2.0231 2.2704 2.5716 2.3591 3.9937 2.0767 2.4994 3.7063 3.6503 2.7336 3.4970 3.0725 2.5452 1.2752 1.8802 2.0195 1.9575 1.6566 1.9247 1.5343 1.5550 1.7944 2.0272 1.5140 1.9843 2.2205 2.0401 1.6335 1.8862 1.9121 1.6536 1.8130 1.7662 1.3905 1.4032 1.7708 1.2993 1.7624 1.2050 1.2393 1.0883 1.0726 1.0606 1.0543 1.0671 1.0781 1.0681 1.0550 1.0677 8.3601 6.6061 1.0624 1.0388 1.0652 1.0374 1.0650 1.0376 1.0871 1.0943 1.0955 1.1019 1.0988 1.0955 1.0979 1.0999 1.0907 1.1005
irintensity: 4.5361 0.3822 0.2258 0.5301 0.6833 0.0591 0.1120 0.8564 0.2804 7.8960 1.3280 4.9207 1.1305 3.4355 0.9148 3.5637 0.4813 0.3192 3.9174 4.2401 8.1817 11.0959 0.9239 1.2565 10.4979 6.7933 1.7870 2.3593 1.1184 4.1681 3.3069 8.0486 14.0756 7.4296 17.2241 35.7310 14.8599 0.3305 11.6482 0.7819 9.6582 1.9985 0.9019 1.1253 59.0631 10.0765 7.9001 12.1610 22.6164 10.0419 7.7401 19.5432 12.5529 1.5660 12.8664 20.1550 15.8953 103.4405 1.5437 30.6811 55.5226 45.0078 17.6667 36.7635 3.9868 54.6957 20.7926 16.1088 43.1394 29.2781 27.4313 20.1813 28.5560 38.8970 13.2366
temp: 298.150 k
press: 1.00000 atm
elementType: 8 6 6 6 6 6 6 6 6 6 6 1 1 1 1 1 1 1 1 1 1 1 1 1 1 1 1
symmnumber: 1
zpe: 614687.1 jmol-1
zpe.correction: 0.234122 hartree
zpe.thermalcorrener: 0.246317 hartree
zpe.thermalcorrenthalpy: 0.247261 hartree
zpe.thermalcorrgfe: 0.196573 hartree
zpe.sumelectzpe: -465.006982 hartree
zpe.sumelectthermal: -464.994787 hartree
zpe.sumelectthermalent: -464.993843 hartree
zpe.sumelectthermalfe: -465.044530 hartree
dipole: 0.1052 -0.3581 -3.1336
dipole: 3.1558
quadrupole: -65.6649 -64.6355 -74.0959
quadrupole: -0.2652 4.5983 2.0046
quadrupole: 2.4672 3.4966 -5.9638 -0.2652 4.5983 2.0046
hfenergy: -465.2411036 hartree
pointgroup: C01 [X(C10H16O1)]
dipole: -0.0136829 0.3052856 1.2033762 debye
polarizability: 112.4609421|6.1867793|98.7783633|-0.9250014|-7.9607769|103.2790282 unknown
InChI: InChI=1S/C10H16O/c1-8-4-6-10(3,7-5-8)9(2)11/h4H,5-7H2,1-3H3
charge 0 multiplicity 1
27 atoms
O  1.498435 -0.956866 -1.669071
C  0.908988 0.665983 0.086667
C  0.151298 0.467533 1.431145
C  -0.061444 1.273204 -0.962686
C  -1.087176 -0.447101 1.293714
C  2.113477 1.635062 0.299916
C  -1.94329 -0.101009 0.082054
C  -1.460077 0.6851 -0.917716
C  1.514312 -0.666575 -0.443061
C  -3.337124 -0.696899 0.0504
C  2.193814 -1.603905 0.555705
H  -0.180105 1.469962 1.768688
H  0.832256 0.079679 2.213052
H  0.365362 1.113772 -1.971385
H  -0.114965 2.372494 -0.811988
H  -1.7024 -0.375537 2.21426
H  -0.782041 -1.51427 1.228517
H  1.744336 2.596626 0.702673
H  2.852709 1.231489 1.01616
H  2.631254 1.838164 -0.655061
H  -2.109281 0.915291 -1.774923
H  -3.877558 -0.425321 -0.873063
H  -3.940785 -0.355717 0.915532
H  -3.299004 -1.80358 0.108484
H  2.823111 -1.056775 1.27951
H  1.430296 -2.1532 1.138986
H  2.805702 -2.337004 0.00749
