program: Orca
programVersion: 5.0.4
elementType: Cl S S P O O C C C C C H H H H H H H H H H H H
charge: 0
multiplicity: 1
keywords: wb97x-d3
keywords: def2-TZVPP
keywords: def2/J RIJCOSX
keywords: DEFGRID2
keywords: scfconv7
keywords: smallprint printgap noloewdin
keywords: NOSOSCF
formula: C5H12ClO2PS2
InChI: InChI=1/C5H12ClO2PS2/c1-3-7-9(10,8-4-2)11-5-6/h3-5H2,1-2H3
23 atoms
Cl -3.11107 -0.390284 0.078422
S  -0.768088 1.144427 -0.972914
S  0.312344 0.490094 2.195726
P  0.472922 0.057982 0.332649
O  0.229202 -1.488935 0.057347
O  1.876527 0.306705 -0.38205
C  0.166061 -2.064764 -1.269235
C  2.640053 1.52093 -0.214666
C  0.389302 -3.549042 -1.14298
C  4.104866 1.172483 -0.253015
C  -2.288179 1.191961 -0.016919
H  -0.815832 -1.848967 -1.691647
H  0.923833 -1.618339 -1.914685
H  2.375663 2.203926 -1.022856
H  2.378308 1.995687 0.733092
H  0.329552 -3.998931 -2.133825
H  1.374244 -3.772176 -0.733243
H  -0.367848 -4.018891 -0.515913
H  4.37825 0.50718 0.565563
H  4.38022 0.700602 -1.19619
H  4.689928 2.086593 -0.154024
H  -2.090567 1.533895 0.997069
H  -2.954129 1.894609 -0.513128
elementType: Cl S P O C H
totalener: -1946.32768679 hartree
nucrepener: 1156.01012302 hartree
electener: -3102.33780981 hartree
oneelecener: -4984.50111809 hartree
twoeener: 1882.16330828 hartree
cpcmener: -0.01886069 hartree
kineticenergy: 1941.98924361 hartree
xcener: -109.899049192636 hartree
chargesum: -0.0000000
charge: -0.145616 -0.129165 -0.429758 0.619984 -0.332939 -0.344652 0.030024 0.040829 -0.241605 -0.237267 -0.098227 0.089501 0.118298 0.105342 0.092727 0.089305 0.089483 0.088610 0.086525 0.090330 0.089315 0.152278 0.176678
qa: -0.1456 -0.1292 -0.4298 0.6200 -0.3329 -0.3447 0.0300 0.0408 -0.2416 -0.2373 -0.0982 0.0895 0.1183 0.1053 0.0927 0.0893 0.0895 0.0886 0.0865 0.0903 0.0893 0.1523 0.1767
va: 1.1261 2.3033 2.0356 5.4667 2.1082 2.0969 3.8363 3.8323 3.9655 3.9643 4.0240 1.0036 0.9912 0.9922 1.0069 1.0052 1.0063 1.0041 1.0073 1.0034 1.0068 1.0192 0.9860
dispcorr: -0.009485247 hartree
energy: -1946.337172039029
dipole: 17.55966 -16.93779 0.62187 -3.51847 4.27280 0.75432 -7.73237 5.81506 -1.91730
magnitude: 2.15216 au
magnitude: 5.47035 debye
