program: Orca
programVersion: 5.0.4
elementType: Cl S S P O O C C C C C H H H H H H H H H H H H
charge: 0
multiplicity: 1
keywords: wb97x-d3
keywords: def2-TZVPP
keywords: def2/J RIJCOSX
keywords: DEFGRID2
keywords: scfconv7
keywords: smallprint printgap noloewdin
keywords: NOSOSCF
formula: C5H12ClO2PS2
InChI: InChI=1/C5H12ClO2PS2/c1-3-7-9(10,8-4-2)11-5-6/h3-5H2,1-2H3
23 atoms
Cl -2.977299 0.404741 -0.677442
S  -0.486859 1.886024 0.09991
S  -0.231832 -0.815883 2.144023
P  0.398406 0.031405 0.535732
O  0.194966 -0.781505 -0.824197
O  1.936608 0.451196 0.581057
C  -0.10398 -2.191969 -0.87511
C  2.853948 0.407851 -0.538397
C  1.119133 -3.037246 -0.633901
C  2.587517 1.47695 -1.566706
C  -2.204252 1.517064 0.487043
H  -0.891366 -2.419539 -0.156304
H  -0.503417 -2.353283 -1.874783
H  3.833175 0.549534 -0.085334
H  2.838169 -0.585768 -0.985065
H  0.847074 -4.088557 -0.726248
H  1.901047 -2.829858 -1.363203
H  1.523997 -2.88793 0.367594
H  2.598282 2.472789 -1.124915
H  3.37892 1.440251 -2.316285
H  1.641139 1.332016 -2.086807
H  -2.281678 1.076149 1.478298
H  -2.741563 2.462631 0.466762
elementType: Cl S P O C H
totalener: -1946.32331505 hartree
nucrepener: 1178.67005318 hartree
electener: -3124.99336824 hartree
oneelecener: -5029.81790801 hartree
twoeener: 1904.82453978 hartree
cpcmener: -0.01867986 hartree
kineticenergy: 1941.98718698 hartree
xcener: -109.902224220043 hartree
chargesum: -0.0000000
charge: -0.147969 -0.117116 -0.440444 0.623472 -0.340082 -0.361658 0.054690 0.041371 -0.254018 -0.263579 -0.105838 0.088583 0.111845 0.111434 0.106452 0.105524 0.092581 0.084353 0.095478 0.104490 0.082583 0.151503 0.176345
qa: -0.1480 -0.1171 -0.4404 0.6235 -0.3401 -0.3617 0.0547 0.0414 -0.2540 -0.2636 -0.1058 0.0886 0.1118 0.1114 0.1065 0.1055 0.0926 0.0844 0.0955 0.1045 0.0826 0.1515 0.1763
va: 1.1244 2.3220 2.0155 5.4357 2.0480 2.0948 3.8151 3.8589 3.9269 3.8924 4.0460 1.0193 0.9913 0.9907 0.9905 1.0100 1.0023 1.0167 1.0008 1.0114 1.0175 1.0219 0.9835
dispcorr: -0.010829752 hartree
energy: -1946.334144804928
dipole: 15.80736 -14.94610 0.86126 -6.71128 6.68182 -0.02945 -8.08383 6.61095 -1.47288
magnitude: 1.70646 au
magnitude: 4.33748 debye
