program: Orca
programVersion: 5.0.4
elementType: Cl S S P O O C C C C C H H H H H H H H H H H H
charge: 0
multiplicity: 1
keywords: wb97x-d3
keywords: def2-TZVPP
keywords: def2/J RIJCOSX
keywords: DEFGRID2
keywords: scfconv7
keywords: smallprint printgap noloewdin
keywords: NOSOSCF
formula: C5H12ClO2PS2
InChI: InChI=1/C5H12ClO2PS2/c1-3-7-9(10,8-4-2)11-5-6/h3-5H2,1-2H3
23 atoms
Cl -2.79059 0.414737 -1.276459
S  -0.798342 0.8635 0.933321
S  1.833088 -0.94808 1.627095
P  0.777674 -0.283874 0.165334
O  0.142725 -1.339247 -0.848572
O  1.49708 0.624965 -0.933653
C  -0.262349 -2.66224 -0.437078
C  2.564798 1.542151 -0.611768
C  -1.419078 -2.677857 0.531847
C  2.116001 2.744182 0.182927
C  -1.583965 1.514683 -0.555016
H  -0.533183 -3.15885 -1.366573
H  0.601653 -3.180529 -0.01822
H  3.352974 0.999942 -0.08653
H  2.955354 1.84707 -1.580583
H  -2.280295 -2.134572 0.146808
H  -1.717108 -3.714932 0.688712
H  -1.15199 -2.263619 1.503918
H  2.951718 3.441659 0.246722
H  1.285548 3.262894 -0.296744
H  1.825717 2.486723 1.200836
H  -2.100927 2.424609 -0.258215
H  -0.848944 1.763717 -1.315163
elementType: Cl S P O C H
totalener: -1946.32457277 hartree
nucrepener: 1177.87325977 hartree
electener: -3124.19783253 hartree
oneelecener: -5028.05676361 hartree
twoeener: 1903.85893108 hartree
cpcmener: -0.01757260 hartree
kineticenergy: 1941.98441547 hartree
xcener: -109.903130547283 hartree
chargesum: 0.0000000
charge: -0.149068 -0.112548 -0.441388 0.627210 -0.344213 -0.351046 0.030744 0.039477 -0.249792 -0.258402 -0.095003 0.115365 0.098752 0.098547 0.113082 0.086318 0.106338 0.077162 0.107095 0.094124 0.081679 0.174770 0.150795
qa: -0.1491 -0.1125 -0.4414 0.6272 -0.3442 -0.3510 0.0307 0.0395 -0.2498 -0.2584 -0.0950 0.1154 0.0988 0.0985 0.1131 0.0863 0.1063 0.0772 0.1071 0.0941 0.0817 0.1748 0.1508
va: 1.1243 2.3014 2.0208 5.4467 2.0933 2.0961 3.8408 3.8329 3.8854 3.9033 4.0211 0.9904 1.0107 1.0107 0.9918 1.0205 1.0118 1.0159 1.0112 1.0031 1.0119 0.9890 1.0200
dispcorr: -0.011278585 hartree
energy: -1946.335851352305
dipole: 6.88962 -6.94830 -0.05868 1.38794 -0.31743 1.07050 0.33824 -1.15007 -0.81182
magnitude: 1.34480 au
magnitude: 3.41820 debye
