program: Orca
programVersion: 5.0.4
elementType: Cl S S P O O C C C C C H H H H H H H H H H H H
charge: 0
multiplicity: 1
keywords: wb97x-d3
keywords: def2-TZVPP
keywords: def2/J RIJCOSX
keywords: DEFGRID2
keywords: scfconv7
keywords: smallprint printgap noloewdin
keywords: NOSOSCF
formula: C5H12ClO2PS2
InChI: InChI=1/C5H12ClO2PS2/c1-3-7-9(10,8-4-2)11-5-6/h3-5H2,1-2H3
23 atoms
Cl -1.81929 2.709553 0.316666
S  -1.717869 -0.006436 -0.94337
S  0.13508 -0.555984 1.867313
P  0.148479 -0.300573 -0.040214
O  0.700444 -1.493865 -0.944771
O  0.994782 0.929003 -0.594452
C  0.392577 -2.880323 -0.679646
C  2.174682 1.417626 0.080297
C  1.677508 -3.648124 -0.508485
C  3.331484 0.451627 0.006421
C  -2.500849 1.059043 0.274099
H  -0.232925 -2.969631 0.210832
H  -0.181612 -3.245725 -1.530802
H  2.411576 2.350009 -0.428184
H  1.922844 1.652661 1.115761
H  2.241382 -3.287325 0.3521
H  1.448685 -4.701092 -0.344178
H  2.307549 -3.577195 -1.395243
H  3.141813 -0.461071 0.572583
H  3.567811 0.183187 -1.023003
H  4.212114 0.927458 0.43895
H  -3.552222 1.130574 0.003048
H  -2.411979 0.630031 1.269737
elementType: Cl S P O C H
totalener: -1946.32612696 hartree
nucrepener: 1165.93626658 hartree
electener: -3112.26239354 hartree
oneelecener: -5004.55888511 hartree
twoeener: 1892.29649157 hartree
cpcmener: -0.01655997 hartree
kineticenergy: 1941.99912422 hartree
xcener: -109.901941807621 hartree
chargesum: 0.0000000
charge: -0.148335 -0.113071 -0.443662 0.630985 -0.354301 -0.342554 0.044630 0.038596 -0.239921 -0.237226 -0.105811 0.088283 0.110033 0.112924 0.093099 0.081630 0.096423 0.092658 0.073822 0.093236 0.100315 0.176474 0.151774
qa: -0.1483 -0.1131 -0.4437 0.6310 -0.3543 -0.3426 0.0446 0.0386 -0.2399 -0.2372 -0.1058 0.0883 0.1100 0.1129 0.0931 0.0816 0.0964 0.0927 0.0738 0.0932 0.1003 0.1765 0.1518
va: 1.1226 2.3322 1.9958 5.4347 2.0878 2.0954 3.8356 3.8441 3.9433 3.9078 4.0323 1.0106 0.9938 0.9910 1.0133 1.0078 1.0089 1.0029 1.0152 1.0063 1.0093 0.9853 1.0226
dispcorr: -0.010086426 hartree
energy: -1946.336213389017
dipole: 16.62552 -16.42589 0.19963 -14.21656 13.28623 -0.93033 -1.31397 0.92009 -0.39388
magnitude: 1.02981 au
magnitude: 2.61756 debye
