program: Orca
programVersion: 5.0.4
elementType: Cl S S P O O C C C C C H H H H H H H H H H H H
charge: 0
multiplicity: 1
keywords: wb97x-d3
keywords: def2-TZVPP
keywords: def2/J RIJCOSX
keywords: DEFGRID2
keywords: scfconv7
keywords: smallprint printgap noloewdin
keywords: NOSOSCF
formula: C5H12ClO2PS2
InChI: InChI=1/C5H12ClO2PS2/c1-3-7-9(10,8-4-2)11-5-6/h3-5H2,1-2H3
23 atoms
Cl -3.095966 0.366025 -1.25638
S  -1.237258 1.253377 0.926699
S  1.346373 -0.403745 2.059876
P  0.375167 0.022948 0.456599
O  -0.318298 -1.158871 -0.353057
O  1.192749 0.755368 -0.708635
C  0.473632 -2.277119 -0.83252
C  2.24568 1.702537 -0.421231
C  0.127304 -3.521746 -0.057734
C  3.595094 1.064487 -0.63112
C  -1.954089 1.612669 -0.690085
H  0.230278 -2.383328 -1.888603
H  1.541112 -2.058642 -0.759868
H  2.089179 2.536378 -1.103483
H  2.149333 2.083807 0.59716
H  -0.936168 -3.750478 -0.124677
H  0.677353 -4.365861 -0.474281
H  0.401166 -3.426151 0.992496
H  3.75914 0.24287 0.065347
H  3.706873 0.690932 -1.648487
H  4.372463 1.809242 -0.460835
H  -2.503293 2.544823 -0.581883
H  -1.183249 1.74854 -1.443433
elementType: Cl S P O C H
totalener: -1946.32599311 hartree
nucrepener: 1156.11469389 hartree
electener: -3102.44068701 hartree
oneelecener: -4984.61583014 hartree
twoeener: 1882.17514313 hartree
cpcmener: -0.01943067 hartree
kineticenergy: 1941.98662721 hartree
xcener: -109.897878332398 hartree
chargesum: 0.0000000
charge: -0.149165 -0.111131 -0.448501 0.631578 -0.339855 -0.345689 0.040427 0.058675 -0.230091 -0.237684 -0.111341 0.107271 0.089905 0.108522 0.084043 0.089808 0.093968 0.073740 0.075012 0.091039 0.097437 0.174854 0.157175
qa: -0.1492 -0.1111 -0.4485 0.6316 -0.3399 -0.3457 0.0404 0.0587 -0.2301 -0.2377 -0.1113 0.1073 0.0899 0.1085 0.0840 0.0898 0.0940 0.0737 0.0750 0.0910 0.0974 0.1749 0.1572
va: 1.1173 2.3352 2.0045 5.4441 2.0931 2.0603 3.8782 3.8251 3.9351 3.9296 4.0495 0.9956 0.9988 0.9947 1.0159 1.0045 1.0080 1.0173 1.0177 1.0041 1.0091 0.9862 1.0134
dispcorr: -0.010124307 hartree
energy: -1946.336117421041
dipole: 17.72247 -16.82558 0.89689 -5.10325 5.94916 0.84591 -5.60982 3.84041 -1.76942
magnitude: 2.15658 au
magnitude: 5.48158 debye
