program: Orca
programVersion: 5.0.4
elementType: Cl S S P O O C C C C C H H H H H H H H H H H H
charge: 0
multiplicity: 1
keywords: wb97x-d3
keywords: def2-TZVPP
keywords: def2/J RIJCOSX
keywords: DEFGRID2
keywords: scfconv7
keywords: smallprint printgap noloewdin
keywords: NOSOSCF
formula: C5H12ClO2PS2
InChI: InChI=1/C5H12ClO2PS2/c1-3-7-9(10,8-4-2)11-5-6/h3-5H2,1-2H3
23 atoms
Cl -2.688782 -0.16118 -1.632438
S  -1.45275 1.046946 0.833803
S  1.205206 -0.191844 2.327516
P  0.46263 0.252371 0.612178
O  0.335448 -0.927577 -0.45847
O  1.206366 1.36786 -0.24881
C  -0.16693 -2.230676 -0.099687
C  2.650625 1.449309 -0.311131
C  0.352142 -3.227319 -1.102326
C  3.277688 0.295068 -1.053329
C  -1.990627 1.297182 -0.871675
H  0.164337 -2.487429 0.908453
H  -1.257075 -2.195749 -0.101273
H  2.845666 2.390843 -0.82014
H  3.044565 1.526461 0.703869
H  1.441086 -3.276259 -1.085355
H  -0.032108 -4.216021 -0.852645
H  0.026953 -2.988242 -2.114806
H  4.340863 0.501727 -1.179128
H  3.190729 -0.64513 -0.508749
H  2.84319 0.169191 -2.044739
H  -2.76958 2.055701 -0.836992
H  -1.181366 1.659163 -1.498985
elementType: Cl S P O C H
totalener: -1946.32691173 hartree
nucrepener: 1165.45245352 hartree
electener: -3111.77936525 hartree
oneelecener: -5003.20829504 hartree
twoeener: 1891.42892979 hartree
cpcmener: -0.01683455 hartree
kineticenergy: 1941.98621688 hartree
xcener: -109.899399353205 hartree
chargesum: -0.0000000
charge: -0.145706 -0.117478 -0.444870 0.635066 -0.332623 -0.346574 0.031422 0.027409 -0.234963 -0.233178 -0.109092 0.100588 0.093070 0.111276 0.095883 0.089080 0.092681 0.087029 0.100891 0.075484 0.091357 0.174586 0.158661
qa: -0.1457 -0.1175 -0.4449 0.6351 -0.3326 -0.3466 0.0314 0.0274 -0.2350 -0.2332 -0.1091 0.1006 0.0931 0.1113 0.0959 0.0891 0.0927 0.0870 0.1009 0.0755 0.0914 0.1746 0.1587
va: 1.1240 2.3274 2.0186 5.4213 2.0629 2.0961 3.8192 3.8604 3.9415 3.8876 4.0355 1.0144 1.0067 0.9904 1.0085 1.0053 1.0074 1.0066 1.0093 1.0184 1.0069 0.9873 1.0143
dispcorr: -0.010549760 hartree
energy: -1946.337461492837
dipole: 15.17637 -14.80985 0.36652 -7.06803 7.32617 0.25814 -7.31767 5.76744 -1.55023
magnitude: 1.61375 au
magnitude: 4.10182 debye
