program: Orca
programVersion: 5.0.4
elementType: Cl S S P O O C C C C C H H H H H H H H H H H H
charge: 0
multiplicity: 1
keywords: wb97x-d3
keywords: def2-TZVPP
keywords: def2/J RIJCOSX
keywords: DEFGRID2
keywords: scfconv7
keywords: smallprint printgap noloewdin
keywords: NOSOSCF
formula: C5H12ClO2PS2
InChI: InChI=1/C5H12ClO2PS2/c1-3-7-9(10,8-4-2)11-5-6/h3-5H2,1-2H3
23 atoms
Cl -1.360315 2.707451 -0.476214
S  -1.750192 -0.268835 -0.552437
S  0.258125 -0.082441 2.21307
P  0.123145 -0.557394 0.355792
O  0.359033 -2.11726 0.120988
O  1.090113 0.208847 -0.659486
C  0.306977 -2.741792 -1.184911
C  2.415932 0.649857 -0.281124
C  1.296988 -3.875924 -1.211183
C  2.412152 2.119158 0.054824
C  -2.228332 1.298674 0.189374
H  -0.709507 -3.106179 -1.342244
H  0.536842 -2.017915 -1.968766
H  2.793722 0.056004 0.552901
H  3.045509 0.443969 -1.145549
H  1.234421 -4.378202 -2.176377
H  2.31791 -3.516508 -1.084482
H  1.084009 -4.612505 -0.436804
H  1.801428 2.326897 0.932286
H  3.432801 2.436376 0.270675
H  2.043589 2.718176 -0.777416
H  -3.289498 1.425471 -0.012341
H  -2.065851 1.274184 1.264622
elementType: Cl S P O C H
totalener: -1946.32451431 hartree
nucrepener: 1163.66774274 hartree
electener: -3109.99225705 hartree
oneelecener: -4999.84578167 hartree
twoeener: 1889.85352462 hartree
cpcmener: -0.01896589 hartree
kineticenergy: 1941.98149220 hartree
xcener: -109.897071598038 hartree
chargesum: 0.0000000
charge: -0.142823 -0.121977 -0.437409 0.625859 -0.352175 -0.339822 0.027698 0.058042 -0.248013 -0.243022 -0.103888 0.109612 0.112360 0.091388 0.108164 0.090722 0.087793 0.089862 0.073018 0.102057 0.086305 0.174887 0.151361
qa: -0.1428 -0.1220 -0.4374 0.6259 -0.3522 -0.3398 0.0277 0.0580 -0.2480 -0.2430 -0.1039 0.1096 0.1124 0.0914 0.1082 0.0907 0.0878 0.0899 0.0730 0.1021 0.0863 0.1749 0.1514
va: 1.1292 2.3146 2.0054 5.4511 2.1091 2.0578 3.8337 3.8218 3.9757 3.9262 4.0593 0.9886 0.9914 1.0097 0.9952 1.0054 1.0056 1.0029 1.0205 1.0117 1.0052 0.9835 1.0210
dispcorr: -0.010111871 hartree
energy: -1946.334626180881
dipole: 13.48948 -13.16079 0.32870 -9.64747 9.00606 -0.64141 -5.42876 3.92002 -1.50874
magnitude: 1.67205 au
magnitude: 4.25000 debye
