program: Orca
programVersion: 5.0.4
elementType: Cl S S P O O C C C C C H H H H H H H H H H H H
charge: 0
multiplicity: 1
keywords: wb97x-d3
keywords: def2-TZVPP
keywords: def2/J RIJCOSX
keywords: DEFGRID2
keywords: scfconv7
keywords: smallprint printgap noloewdin
keywords: NOSOSCF
formula: C5H12ClO2PS2
InChI: InChI=1/C5H12ClO2PS2/c1-3-7-9(10,8-4-2)11-5-6/h3-5H2,1-2H3
23 atoms
Cl -2.454678 0.273455 -1.799897
S  -1.550137 0.56268 1.064163
S  1.281572 -0.565834 2.199231
P  0.431081 0.086415 0.601531
O  0.444545 -0.89974 -0.653935
O  0.933441 1.450043 -0.055333
C  0.443796 -2.335821 -0.535972
C  1.98045 1.546733 -1.049513
C  -0.883293 -2.886748 -0.077486
C  3.334736 1.149658 -0.520247
C  -2.151955 1.374765 -0.430152
H  0.687726 -2.691291 -1.535454
H  1.247937 -2.641006 0.13577
H  1.70525 0.95742 -1.924278
H  1.973395 2.595181 -1.341891
H  -0.847426 -3.974894 -0.137652
H  -1.102604 -2.621817 0.956761
H  -1.702387 -2.541298 -0.706923
H  4.082401 1.360315 -1.285596
H  3.598986 1.718442 0.370847
H  3.393081 0.086797 -0.285812
H  -3.098124 1.837496 -0.156517
H  -1.465377 2.148907 -0.75946
elementType: Cl S P O C H
totalener: -1946.32397969 hartree
nucrepener: 1177.86316867 hartree
electener: -3124.18714836 hartree
oneelecener: -5028.09649552 hartree
twoeener: 1903.90934716 hartree
cpcmener: -0.01810970 hartree
kineticenergy: 1941.97635101 hartree
xcener: -109.901013534200 hartree
chargesum: -0.0000000
charge: -0.145703 -0.112407 -0.447156 0.631776 -0.330078 -0.360508 0.041320 0.050482 -0.243349 -0.248599 -0.114852 0.111102 0.094888 0.098035 0.109523 0.104218 0.073910 0.084372 0.100403 0.090720 0.079124 0.175473 0.157307
qa: -0.1457 -0.1124 -0.4472 0.6318 -0.3301 -0.3605 0.0413 0.0505 -0.2433 -0.2486 -0.1149 0.1111 0.0949 0.0980 0.1095 0.1042 0.0739 0.0844 0.1004 0.0907 0.0791 0.1755 0.1573
va: 1.1265 2.3272 2.0167 5.4298 2.0682 2.0978 3.8336 3.8487 3.9088 3.9330 4.0537 0.9901 1.0148 1.0018 0.9870 1.0136 1.0146 1.0156 1.0102 1.0057 1.0126 0.9848 1.0059
dispcorr: -0.011158436 hartree
energy: -1946.335138129282
dipole: 11.61413 -11.52568 0.08846 -4.10113 4.50299 0.40187 -4.86704 3.03807 -1.82896
magnitude: 1.87468 au
magnitude: 4.76506 debye
