program: Orca
programVersion: 5.0.4
elementType: Cl S S P O O C C C C C H H H H H H H H H H H H
charge: 0
multiplicity: 1
keywords: wb97x-d3
keywords: def2-TZVPP
keywords: def2/J RIJCOSX
keywords: DEFGRID2
keywords: scfconv7
keywords: smallprint printgap noloewdin
keywords: NOSOSCF
formula: C5H12ClO2PS2
InChI: InChI=1/C5H12ClO2PS2/c1-3-7-9(10,8-4-2)11-5-6/h3-5H2,1-2H3
23 atoms
Cl -1.562555 2.541971 -0.518419
S  -1.623206 -0.465146 -0.473861
S  0.37194 -0.016515 2.268646
P  0.277643 -0.519712 0.415346
O  0.696464 -2.041723 0.185469
O  1.125034 0.362267 -0.610916
C  0.834786 -2.658106 -1.119984
C  2.432042 0.890117 -0.283633
C  -0.228197 -3.707365 -1.319295
C  2.342438 2.367643 -0.005146
C  -2.258521 1.071072 0.21334
H  0.800386 -1.907503 -1.911548
H  1.82853 -3.102978 -1.135345
H  2.862215 0.355528 0.564638
H  3.054817 0.687241 -1.153455
H  -1.228987 -3.2784 -1.366419
H  -0.044916 -4.219546 -2.264204
H  -0.206697 -4.453349 -0.525703
H  1.915832 2.907116 -0.850338
H  1.739518 2.569984 0.87883
H  3.344157 2.759932 0.171514
H  -3.329729 1.0709 0.023087
H  -2.083065 1.108179 1.28558
elementType: Cl S P O C H
totalener: -1946.32400091 hartree
nucrepener: 1167.35117654 hartree
electener: -3113.67517745 hartree
oneelecener: -5007.22446442 hartree
twoeener: 1893.54928697 hartree
cpcmener: -0.01929175 hartree
kineticenergy: 1941.98143081 hartree
xcener: -109.897667554182 hartree
chargesum: 0.0000000
charge: -0.143838 -0.125009 -0.439064 0.629073 -0.356132 -0.335996 0.020017 0.058660 -0.227220 -0.240939 -0.105015 0.104606 0.110953 0.090105 0.107320 0.077542 0.096120 0.092043 0.086189 0.072979 0.101463 0.175224 0.150919
qa: -0.1438 -0.1250 -0.4391 0.6291 -0.3561 -0.3360 0.0200 0.0587 -0.2272 -0.2409 -0.1050 0.1046 0.1110 0.0901 0.1073 0.0775 0.0961 0.0920 0.0862 0.0730 0.1015 0.1752 0.1509
va: 1.1281 2.3192 2.0082 5.4515 2.0993 2.0582 3.8460 3.8236 3.9440 3.9297 4.0616 0.9990 0.9969 1.0099 0.9958 1.0062 1.0080 1.0032 1.0054 1.0190 1.0113 0.9832 1.0213
dispcorr: -0.010323797 hartree
energy: -1946.334324704216
dipole: 10.47194 -10.05107 0.42088 -8.18631 7.54121 -0.64510 -5.96114 4.39993 -1.56121
magnitude: 1.74088 au
magnitude: 4.42497 debye
