program: Orca
programVersion: 5.0.4
elementType: Cl S S P O O C C C C C H H H H H H H H H H H H
charge: 0
multiplicity: 1
keywords: wb97x-d3
keywords: def2-TZVPP
keywords: def2/J RIJCOSX
keywords: DEFGRID2
keywords: scfconv7
keywords: smallprint printgap noloewdin
keywords: NOSOSCF
formula: C5H12ClO2PS2
InChI: InChI=1/C5H12ClO2PS2/c1-3-7-9(10,8-4-2)11-5-6/h3-5H2,1-2H3
23 atoms
Cl -3.306261 -0.06404 0.541549
S  -0.970419 0.861878 -1.102864
S  0.254599 -0.135329 1.943696
P  0.591286 0.065756 0.060839
O  1.03824 -1.255811 -0.723038
O  1.747519 1.078423 -0.377052
C  0.57951 -2.577727 -0.379311
C  3.107231 0.853358 0.072985
C  -0.807144 -2.85871 -0.90293
C  3.895447 2.11816 -0.141284
C  -2.198487 1.279759 0.143008
H  1.309083 -3.249402 -0.827871
H  0.625354 -2.706516 0.703718
H  3.100385 0.576824 1.129481
H  3.534446 0.026021 -0.494791
H  -1.047907 -3.904695 -0.712022
H  -1.563682 -2.2498 -0.40873
H  -0.871626 -2.69099 -1.977714
H  3.917795 2.405446 -1.192323
H  3.494959 2.946341 0.442358
H  4.923241 1.948839 0.179044
H  -1.723476 1.61123 1.062004
H  -2.7958 2.088872 -0.26912
elementType: Cl S P O C H
totalener: -1946.32460828 hartree
nucrepener: 1155.41325117 hartree
electener: -3101.73785945 hartree
oneelecener: -4983.39482204 hartree
twoeener: 1881.65696259 hartree
cpcmener: -0.01560361 hartree
kineticenergy: 1941.98216781 hartree
xcener: -109.897761961429 hartree
chargesum: -0.0000000
charge: -0.145814 -0.116759 -0.435077 0.638503 -0.351673 -0.347690 0.046460 0.033195 -0.244113 -0.240125 -0.095205 0.109153 0.092417 0.093138 0.110929 0.101039 0.069219 0.091307 0.088843 0.087241 0.088446 0.147473 0.179094
qa: -0.1458 -0.1168 -0.4351 0.6385 -0.3517 -0.3477 0.0465 0.0332 -0.2441 -0.2401 -0.0952 0.1092 0.0924 0.0931 0.1109 0.1010 0.0692 0.0913 0.0888 0.0872 0.0884 0.1475 0.1791
va: 1.1229 2.3107 2.0221 5.4199 2.0897 2.1210 3.8462 3.8458 3.8999 3.9583 4.0040 0.9912 1.0137 1.0028 0.9952 1.0137 1.0284 1.0057 1.0038 1.0055 1.0063 1.0255 0.9894
dispcorr: -0.009820896 hartree
energy: -1946.334429177630
dipole: 16.43305 -15.43372 0.99933 -3.10247 3.02530 -0.07717 -3.56089 2.93037 -0.63052
magnitude: 1.18413 au
magnitude: 3.00983 debye
