program: Gaussian 09
title: 000065272
version: EM64L-G09RevD.01
frameworkgroup: C1[X(C4H5NO3S)]
method: RPBEPBE
basis: SDD
operation: Freq
keyword: #p
keyword: freq=noraman
keyword: PBEPBE/SDD
title: #p freq=noraman PBEPBE/SDD
converged: YES YES NO NO
title: Mulliken charges:
elementType: S O O O N C C C C H H H H H
charge: 0.193385 -0.416482 -0.169863 -0.205732 -0.307782 -0.148318 -0.704444 -0.057504 0.203633 0.282268 0.299804 0.293422 0.345000 0.392612
chargesum: 0.00000
title: Mulliken charges with hydrogens summed into heavy atoms:
elementType: S O O O N C C C C
charge: 0.193385 -0.023870 -0.169863 -0.205732 0.037218 0.133951 -0.111219 -0.057504 0.203633
polarizability: 8.11240233e+01 -9.53655677e+00 7.82001188e+01 -7.50995208e+00 -5.45956325e-01 5.43271266e+01
1716.lowfreq: -0.0019 0.0005 0.0020 8.6608 11.1343 19.1788 47.3446 76.8948 107.6727
frequency: 47.2641 76.8894 107.6656 250.8672 321.3897 358.6752 421.8968 448.8282 500.4276 555.7366 566.7030 594.7479 638.8435 651.9289 666.7870 747.4793 832.1895 946.2204 969.0381 1044.9544 1078.4024 1145.1399 1210.7722 1219.8929 1267.8524 1303.8146 1331.3722 1402.0756 1452.5934 1672.0777 1698.1649 3008.6337 3063.7103 3155.9108 3519.4704 3556.3063
redmass: 11.0076 7.9569 9.5109 3.4719 3.7005 12.6686 4.3405 4.9923 1.7468 4.6359 5.8583 2.1081 4.2463 2.7900 3.6160 3.5811 4.7659 1.8101 2.7738 2.3623 1.8725 1.4345 2.6396 1.4999 1.5389 1.4578 1.7650 1.5005 1.0912 9.9433 10.2041 1.0832 1.0610 1.1065 1.0644 1.0775
irintensity: 0.6082 1.6144 1.6032 1.1142 12.3028 0.8840 33.5415 18.3823 60.3136 18.8892 57.5914 35.5367 89.0917 121.1719 13.6802 1.5262 3.6950 14.7789 41.3616 235.4533 85.0988 5.4649 86.6913 9.2465 17.0387 7.6586 3.8499 15.6469 12.8622 155.6496 523.1973 11.1177 19.2547 1.4550 31.5292 48.6922
temp: 298.150 k
press: 1.00000 atm
elementType: 16 8 8 8 7 6 6 6 6 1 1 1 1 1
symmnumber: 1
zpe: 250227.2 jmol-1
zpe.correction: 0.095307 hartree
zpe.thermalcorrener: 0.103830 hartree
zpe.thermalcorrenthalpy: 0.104774 hartree
zpe.thermalcorrgfe: 0.060749 hartree
zpe.sumelectzpe: -833.243863 hartree
zpe.sumelectthermal: -833.235340 hartree
zpe.sumelectthermalent: -833.234396 hartree
zpe.sumelectthermalfe: -833.278420 hartree
dipole: -4.9218 1.9233 2.7475
dipole: 5.9558
quadrupole: -62.9011 -61.9489 -56.4119
quadrupole: 0.8975 2.7901 -3.4003
quadrupole: -2.4805 -1.5282 4.0087 0.8975 2.7901 -3.4003
hfenergy: -833.3391694 hartree
pointgroup: C01 [X(C4H5N1O3S1)]
dipole: -1.99027 -0.7955258 -0.946861 debye
dipolederiv: -0.1983431 -0.179203 0.1008879 -0.1981432 -0.5191781 0.1940439 0.1489035 0.2501966 -0.1562621 -1.0289612 -0.4256828 0.0812386 -0.3252623 -0.5357542 0.1245582 0.185925 0.1606585 -0.4029566 -1.077341 -0.45187 -0.0560386 -0.5308399 -0.753494 0.0659111 -0.0749881 0.0669173 -0.3711487 -0.5728326 0.0906536 0.0890026 -0.0870276 -0.9159826 -0.0337523 0.1220254 -0.1705044 -0.3381028 -0.8852933 0.0474979 -0.1555783 -0.0026793 -0.4462473 0.0402728 -0.3130852 0.1229149 -0.7824532 0.4496343 0.0080694 -0.0132212 0.2521111 0.0497965 0.0121626 -0.0336768 -0.0216329 0.1805027 0.1509885 0.0998746 0.0759669 0.0060049 0.0599598 0.1246316 0.1245224 0.1248214 0.1099736 1.489772 0.5920871 0.2751998 0.5994652 1.2545818 -0.4945022 0.362858 -0.511673 0.7740311 1.1862456 0.2120427 -0.3071444 0.2378358 1.2180907 0.0407263 -0.4106983 0.1524172 0.335644 -0.0289996 0.0105748 -0.0602005 0.0120006 0.0943105 -0.0041079 -0.082318 -0.0220425 -0.0267307 0.013981 -0.0861027 0.0167488 -0.0532261 0.1061677 0.0225585 0.0118724 0.010739 0.062488 0.0138459 0.0220989 -0.0064264 0.044836 -0.0065506 -0.0709385 -0.043891 -0.1304768 -0.0472262 0.1873612 -0.0069355 -0.1003227 -0.0602163 0.2034129 0.0700821 -0.0708728 0.042807 0.3227956 0.2999423 0.0668951 0.0598874 0.105141 0.1908869 -0.0916463 0.0734236 -0.0751423 0.3394452 unknown
polarizability: 83.054841|10.7380687|73.7808841|5.3463751|-6.5413297|56.8155436 unknown
InChI: InChI=1S/C4H5NO3S/c6-3(7)2-1-9-4(8)5-2/h2,5-6H,1H2
charge 0 multiplicity 1
14 atoms
S  1.271569 -1.278032 1.031707
O  -2.680144 -0.344579 0.333807
O  2.748662 0.910064 0.115312
O  -1.546237 1.68765 0.267858
N  0.694127 0.436758 -0.94397
C  -0.542418 -0.327051 -0.798765
C  -0.156575 -1.677299 -0.140862
C  1.713982 0.232415 -0.016969
C  -1.597113 0.472713 0.000718
H  -0.995104 -0.530099 -1.788525
H  -0.994119 -2.104692 0.424616
H  0.206281 -2.387876 -0.89833
H  0.70698 1.313596 -1.469295
H  -3.37319 0.186333 0.811897
