program: Orca
programVersion: 5.0.4
elementType: Cl S S P O O C C C C C H H H H H H H H H H H H
charge: 0
multiplicity: 1
keywords: wb97x-d3
keywords: def2-TZVPP
keywords: def2/J RIJCOSX
keywords: DEFGRID2
keywords: scfconv7
keywords: smallprint printgap noloewdin
keywords: NOSOSCF
formula: C5H12ClO2PS2
InChI: InChI=1/C5H12ClO2PS2/c1-3-7-9(10,8-4-2)11-5-6/h3-5H2,1-2H3
23 atoms
Cl -3.020999 -0.698046 0.318876
S  -1.00727 0.910862 -1.242898
S  0.277573 1.120151 1.92711
P  0.464611 0.38093 0.164282
O  0.523577 -1.212174 0.211745
O  1.700441 0.86357 -0.727582
C  0.768277 -2.031729 -0.954292
C  2.976007 1.220978 -0.153813
C  -0.433395 -2.886825 -1.263517
C  3.708526 0.043122 0.439011
C  -2.460616 0.918705 -0.184328
H  1.040488 -1.419906 -1.816906
H  1.633797 -2.648226 -0.70999
H  3.536693 1.64942 -0.982785
H  2.824303 2.005722 0.589981
H  -0.178922 -3.568959 -2.075785
H  -0.730859 -3.48807 -0.403933
H  -1.285705 -2.287868 -1.581183
H  4.699806 0.371661 0.754538
H  3.204217 -0.359192 1.318209
H  3.840952 -0.757787 -0.288905
H  -2.272085 1.505437 0.712357
H  -3.25529 1.389303 -0.760028
elementType: Cl S P O C H
totalener: -1946.33421380 hartree
nucrepener: 1174.37115285 hartree
electener: -3120.70536666 hartree
oneelecener: -5021.21267214 hartree
twoeener: 1900.50730548 hartree
cpcmener: -0.01597262 hartree
kineticenergy: 1941.97981381 hartree
xcener: -109.898736980710 hartree
chargesum: -0.0000000
charge: -0.141648 -0.119392 -0.424300 0.606337 -0.318306 -0.345354 0.032612 0.028736 -0.231007 -0.246055 -0.109577 0.095180 0.106508 0.108701 0.098933 0.098249 0.092581 0.062189 0.104269 0.085605 0.090585 0.151693 0.173461
qa: -0.1416 -0.1194 -0.4243 0.6063 -0.3183 -0.3454 0.0326 0.0287 -0.2310 -0.2461 -0.1096 0.0952 0.1065 0.1087 0.0989 0.0982 0.0926 0.0622 0.1043 0.0856 0.0906 0.1517 0.1735
va: 1.1291 2.3105 2.0394 5.4378 2.0690 2.0800 3.8551 3.8615 3.9390 3.8878 4.0310 0.9976 0.9922 0.9915 1.0085 1.0108 1.0026 1.0268 1.0095 1.0181 1.0039 1.0196 0.9869
dispcorr: -0.010940131 hartree
energy: -1946.345153934474
dipole: 16.42697 -15.39531 1.03166 -6.83769 6.61197 -0.22573 -5.49803 3.95589 -1.54214
magnitude: 1.86908 au
magnitude: 4.75082 debye
