program: Orca
programVersion: 5.0.4
elementType: Cl S S P O O C C C C C H H H H H H H H H H H H
charge: 0
multiplicity: 1
keywords: wb97x-d3
keywords: def2-TZVPP
keywords: def2/J RIJCOSX
keywords: DEFGRID2
keywords: scfconv7
keywords: smallprint printgap noloewdin
keywords: NOSOSCF
formula: C5H12ClO2PS2
InChI: InChI=1/C5H12ClO2PS2/c1-3-7-9(10,8-4-2)11-5-6/h3-5H2,1-2H3
23 atoms
Cl -1.558514 2.720324 0.487304
S  -1.619734 0.166916 -1.085692
S  -0.055646 -0.840328 1.777017
P  0.125405 -0.463059 -0.101304
O  0.54936 -1.663816 -1.066129
O  1.186271 0.643232 -0.524489
C  -0.08826 -2.957592 -0.980327
C  2.285278 1.074556 0.305241
C  0.776965 -3.936493 -0.230405
C  2.612522 2.500104 -0.050707
C  -2.380137 1.160497 0.205884
H  -1.071431 -2.87168 -0.512851
H  -0.242402 -3.277975 -2.009684
H  2.008851 0.99074 1.357649
H  3.132802 0.412054 0.123703
H  0.288208 -4.912381 -0.226874
H  1.750998 -4.054352 -0.704742
H  0.923926 -3.630638 0.805542
H  2.892696 2.603985 -1.099024
H  1.77059 3.161512 0.153204
H  3.45567 2.833955 0.554799
H  -3.399949 1.365006 -0.114674
H  -2.400471 0.611879 1.145004
elementType: Cl S P O C H
totalener: -1946.33493156 hartree
nucrepener: 1160.64468950 hartree
electener: -3106.97962105 hartree
oneelecener: -4993.85485902 hartree
twoeener: 1886.87523797 hartree
cpcmener: -0.01383865 hartree
kineticenergy: 1941.98936052 hartree
xcener: -109.899963593202 hartree
chargesum: 0.0000000
charge: -0.144387 -0.119077 -0.441103 0.642011 -0.353571 -0.329305 0.045794 0.028409 -0.237412 -0.230637 -0.107251 0.084994 0.110724 0.097500 0.112709 0.092960 0.089993 0.075872 0.090182 0.078270 0.088309 0.171838 0.153179
qa: -0.1444 -0.1191 -0.4411 0.6420 -0.3536 -0.3293 0.0458 0.0284 -0.2374 -0.2306 -0.1073 0.0850 0.1107 0.0975 0.1127 0.0930 0.0900 0.0759 0.0902 0.0783 0.0883 0.1718 0.1532
va: 1.1277 2.3229 2.0029 5.4363 2.0994 2.1116 3.8459 3.8359 3.9450 3.9510 4.0370 1.0096 0.9926 1.0085 0.9912 1.0077 1.0035 1.0187 1.0033 1.0107 1.0083 0.9868 1.0205
dispcorr: -0.009632795 hartree
energy: -1946.344564351000
dipole: 11.73538 -11.78892 -0.05353 -10.02060 9.32396 -0.69664 -1.15260 0.72241 -0.43019
magnitude: 0.82051 au
magnitude: 2.08557 debye
