program: Orca
programVersion: 5.0.4
elementType: Cl S S P O O C C C C C H H H H H H H H H H H H
charge: 0
multiplicity: 1
keywords: wb97x-d3
keywords: def2-TZVPP
keywords: def2/J RIJCOSX
keywords: DEFGRID2
keywords: scfconv7
keywords: smallprint printgap noloewdin
keywords: NOSOSCF
formula: C5H12ClO2PS2
InChI: InChI=1/C5H12ClO2PS2/c1-3-7-9(10,8-4-2)11-5-6/h3-5H2,1-2H3
23 atoms
Cl -2.850503 0.409979 -1.252804
S  -0.81915 0.876957 0.926758
S  1.819978 -0.928477 1.635197
P  0.765368 -0.269447 0.169634
O  0.131107 -1.324152 -0.843062
O  1.483398 0.644605 -0.924328
C  -0.25939 -2.652594 -0.440545
C  2.567738 1.541202 -0.607784
C  -1.411149 -2.687702 0.533596
C  2.146508 2.748637 0.193508
C  -1.61053 1.499823 -0.570404
H  -0.530592 -3.143946 -1.373282
H  0.611348 -3.16753 -0.03062
H  3.351477 0.984985 -0.089965
H  2.95721 1.842716 -1.578848
H  -2.280709 -2.152301 0.156096
H  -1.697073 -3.729461 0.685333
H  -1.144686 -2.277636 1.507514
H  2.998974 3.425775 0.263737
H  1.33045 3.291328 -0.28407
H  1.848356 2.492443 1.209604
H  -2.107648 2.427302 -0.295331
H  -0.882848 1.714469 -1.347269
elementType: Cl S P O C H
totalener: -1946.33355892 hartree
nucrepener: 1175.95081735 hartree
electener: -3122.28437627 hartree
oneelecener: -5024.13981796 hartree
twoeener: 1901.85544170 hartree
cpcmener: -0.01493521 hartree
kineticenergy: 1941.97905287 hartree
xcener: -109.902026926051 hartree
chargesum: 0.0000000
charge: -0.147055 -0.112106 -0.435549 0.621259 -0.335605 -0.343858 0.029398 0.036476 -0.248707 -0.256014 -0.097944 0.112999 0.098103 0.098080 0.110898 0.086289 0.104061 0.078547 0.105205 0.092274 0.082726 0.171710 0.148814
qa: -0.1471 -0.1121 -0.4355 0.6213 -0.3356 -0.3439 0.0294 0.0365 -0.2487 -0.2560 -0.0979 0.1130 0.0981 0.0981 0.1109 0.0863 0.1041 0.0785 0.1052 0.0923 0.0827 0.1717 0.1488
va: 1.1252 2.2995 2.0245 5.4529 2.1026 2.1027 3.8466 3.8402 3.8862 3.9036 4.0257 0.9903 1.0102 1.0110 0.9916 1.0202 1.0122 1.0161 1.0114 1.0034 1.0124 0.9895 1.0205
dispcorr: -0.011236594 hartree
energy: -1946.344795516153
dipole: 7.22897 -7.22794 0.00103 1.25439 -0.27470 0.97969 0.21792 -1.04636 -0.82844
magnitude: 1.28301 au
magnitude: 3.26115 debye
