program: Gaussian 09
title: 000006176
version: EM64L-G09RevD.01
frameworkgroup: C1[X(C9H16N3O14P3)]
method: RPBEPBE
basis: SDD
operation: Freq
keyword: #p
keyword: freq=noraman
keyword: PBEPBE/SDD
title: #p freq=noraman PBEPBE/SDD
converged: YES YES NO NO
title: Mulliken charges:
elementType: P P P O O O O O O O O O O O O O O N N N C C C C C C C C C H H H H H H H H H H H H H H H H
charge: 1.484521 1.456210 1.440876 -0.308147 -0.581412 -0.517335 -0.508565 -0.345056 -0.821203 -0.669400 -0.535846 -0.749599 -0.664847 -0.554827 -0.704736 -0.630912 -0.665606 -0.228721 -0.033884 -0.612882 -0.121089 -0.152302 0.030332 -0.015105 -0.356012 -0.088678 0.131951 -0.332736 0.193186 0.277207 0.269215 0.276442 0.273240 0.252457 0.288465 0.447897 0.414905 0.313571 0.242750 0.410774 0.350424 0.329769 0.440878 0.461071 0.412760
chargesum: 0.00000
title: Mulliken charges with hydrogens summed into heavy atoms:
elementType: P P P O O O O O O O O O O O O O O N N N C C C C C C C C C
charge: 1.484521 1.456210 1.440876 -0.308147 -0.133515 -0.102430 -0.508565 -0.345056 -0.821203 -0.258627 -0.535846 -0.749599 -0.223969 -0.554827 -0.243665 -0.218152 -0.665606 -0.228721 -0.033884 0.067310 0.156119 0.116913 0.306774 0.258134 0.184911 0.224893 0.131951 -0.089986 0.193186
polarizability: 3.27922773e+02 -2.12015145e+01 2.55284855e+02 3.07389854e+00 -3.06105433e+00 1.54050620e+02
1716.lowfreq: -4.8255 0.0008 0.0009 0.0013 2.5551 4.0397 11.4225 21.7391 32.8083
frequency: 10.9149 21.6289 32.7850 40.0148 44.3970 53.2118 58.8802 66.5477 71.7763 76.9176 87.0860 105.6192 132.4371 149.6004 157.7529 164.4009 175.8122 180.0417 195.4343 202.5593 213.3086 226.1234 241.4958 246.7084 252.3466 266.1952 269.9984 285.1494 304.4164 322.0911 331.4589 337.1315 342.8287 355.0191 364.1408 367.6846 376.3983 386.3051 411.0824 416.8768 423.3018 434.0726 475.7295 489.2163 521.6637 523.8492 537.9188 553.1027 572.8479 581.7813 591.0616 604.5254 616.5679 655.0348 687.1845 696.3789 704.8165 719.4197 730.7116 745.1474 747.6334 749.5547 769.9817 790.1435 805.2333 835.0125 850.1120 862.0381 874.5251 888.5971 901.7628 936.6156 952.9133 969.0742 994.6721 999.5343 1013.5079 1022.4555 1025.4505 1026.1875 1040.0163 1051.8692 1065.1041 1075.1475 1083.8591 1092.8085 1098.6730 1129.1776 1188.1158 1200.1068 1211.6381 1221.7171 1227.9507 1232.8950 1238.7096 1255.1697 1262.5288 1274.5743 1311.7400 1317.6642 1342.5471 1350.0048 1354.5603 1371.5185 1391.8217 1402.4878 1446.1013 1462.7178 1478.4626 1504.8001 1581.1957 1630.8552 1643.7328 2028.8406 2901.6110 2959.5915 2993.0055 3000.5218 3020.3790 3023.6389 3034.7458 3057.6534 3084.3458 3183.5713 3205.5352 3536.9426 3569.9678 3598.0200 3692.5716
redmass: 7.7782 8.6715 7.6486 9.6322 8.4835 8.2495 9.3799 5.8686 7.8513 9.5180 9.4665 5.2799 2.4537 4.6554 3.7713 6.2469 7.4166 5.2726 6.4805 6.2873 4.6231 6.4016 6.4683 7.6559 3.9271 8.3271 2.9098 7.2861 4.9223 5.1557 4.1949 5.5413 6.6392 4.1027 6.1005 8.9347 6.6325 6.4551 6.4998 9.7261 9.4396 3.2713 1.1432 5.0229 4.0872 12.8977 5.4123 6.8388 12.3076 9.9577 1.2403 5.8931 6.2093 11.1912 7.7417 3.2438 5.2072 5.9215 5.1316 6.2156 2.4988 6.2919 2.9193 1.7048 1.1349 3.7162 8.3680 3.0342 3.1310 3.9953 1.4965 3.1769 6.4178 1.3426 5.0622 4.4590 3.3325 1.2949 2.6824 4.4850 2.3944 3.1216 2.3983 3.3131 5.3136 1.9937 14.6584 2.3575 1.4721 1.5867 1.1190 1.1406 1.1977 2.6423 1.3785 1.2695 1.2104 1.5545 1.2800 1.4171 1.4696 1.1603 1.5446 1.4907 1.6744 1.4291 1.1662 1.0767 4.7653 3.7521 2.7464 1.7227 5.8371 1.0988 1.0666 1.0838 1.0677 1.0594 1.0850 1.0673 1.0849 1.0888 1.1064 1.0901 1.1002 1.0458 1.0664 1.0664 1.1045
irintensity: 0.7365 1.8315 1.8313 0.7530 1.1184 6.3976 9.3108 0.0236 7.1149 1.6470 1.9058 11.0309 42.8909 13.0570 6.2553 27.3317 11.7540 29.7258 8.2418 3.1487 22.0717 16.0318 9.9736 11.5653 29.2076 2.3292 42.5408 4.0881 57.8935 15.3510 82.4002 112.5584 4.8606 34.8999 50.7419 18.8239 101.3200 7.0840 55.4779 119.0393 31.3013 8.1931 116.5477 44.0790 6.8965 29.1509 3.1888 18.0222 36.1293 9.3613 169.5230 11.7221 38.0960 349.9798 75.5338 2.8387 98.9847 269.0402 100.0965 6.5104 162.3741 28.3622 200.8914 73.3253 95.2950 36.7528 253.5537 299.9334 42.9167 48.9800 85.4965 8.5634 178.9515 5.3357 226.3484 159.8142 19.9817 147.4503 30.3705 48.0084 6.8781 78.6685 240.0490 62.9875 211.0381 68.3133 157.4725 16.7499 67.1166 2.1729 135.3758 13.2160 137.3382 102.0347 23.3127 29.9534 37.3657 102.6647 33.4598 5.7141 45.4117 178.0885 12.2286 101.5856 519.9039 4.4544 511.0626 19.1674 37.4903 90.7740 95.8274 111.6384 891.0078 4960.1160 1190.4497 13.0208 113.1093 20.7639 19.1274 396.7525 30.0010 19.1972 3.8922 2.1914 7.1742 153.2342 90.2467 97.9903 47.1463
temp: 298.150 k
press: 1.00000 atm
elementType: 15 15 15 8 8 8 8 8 8 8 8 8 8 8 8 8 8 7 7 7 6 6 6 6 6 6 6 6 6 1 1 1 1 1 1 1 1 1 1 1 1 1 1 1 1
symmnumber: 1
zpe: 781491.2 jmol-1
zpe.correction: 0.297654 hartree
zpe.thermalcorrener: 0.328431 hartree
zpe.thermalcorrenthalpy: 0.329376 hartree
zpe.thermalcorrgfe: 0.233563 hartree
zpe.sumelectzpe: -2591.392991 hartree
zpe.sumelectthermal: -2591.362214 hartree
zpe.sumelectthermalent: -2591.361270 hartree
zpe.sumelectthermalfe: -2591.457082 hartree
dipole: -11.2140 3.6741 -4.4001
dipole: 12.5942
quadrupole: -162.1344 -208.9587 -197.5023
quadrupole: -36.8568 -1.3648 -15.7114
quadrupole: 27.3974 -19.4269 -7.9705 -36.8568 -1.3648 -15.7114
hfenergy: -2591.6906455 hartree
pointgroup: C01 [X(C9H16N3O14P3)]
dipole: -4.4618426 -1.3172604 1.7053546 debye
polarizability: 328.9144833|19.4988248|254.2333061|-1.642955|-4.2889619|154.1104587 unknown
InChI: InChI=1S/C9H16N3O14P3/c10-5-1-2-12(9(15)11-5)8-7(14)6(13)4(24-8)3-23-28(19,20)26-29(21,22)25-27(16,17)18/h1-2,4,6-8,13-14,16-17,19,21H,3,10H2
charge 0 multiplicity 1
45 atoms
P  2.70996 -3.08467 -0.005027
P  4.926279 -0.716206 0.008374
P  4.149294 2.220386 -0.001587
O  -1.255957 -0.631327 -0.187723
O  0.52374 2.418236 -0.146405
O  -1.839575 2.936342 0.07799
O  1.386835 -2.048888 -0.30453
O  -4.213468 2.253033 -0.596978
O  4.022936 -2.060093 0.518893
O  2.294105 -3.680863 1.551425
O  3.020248 -4.106768 -1.156509
O  3.892855 0.576002 0.634077
O  4.642205 -0.659669 -1.663618
O  6.400455 -0.654413 0.565706
O  2.806652 3.027459 0.451843
O  5.311542 2.945833 1.005543
O  4.584282 2.030138 -1.536282
N  -3.539949 0.045559 -0.19473
N  -5.8797 0.639319 -0.282701
N  -7.513259 -0.970463 0.050403
C  -0.100874 1.341785 0.631774
C  -1.64698 1.593392 0.583222
C  0.108033 -0.038649 -0.062967
C  -2.14876 0.497934 -0.409309
C  1.000594 -1.009159 0.690143
C  -3.84969 -1.273765 0.072472
C  -4.577142 1.043965 -0.370813
C  -5.168177 -1.671302 0.182056
C  -6.180993 -0.659027 -0.017926
H  0.294556 1.37331 1.660684
H  -2.109569 1.449426 1.576499
H  0.519936 0.138343 -1.075512
H  -2.061726 0.891032 -1.446405
H  0.46997 -1.492218 1.528845
H  1.905544 -0.484338 1.050903
H  -0.245764 3.074909 -0.327479
H  -2.8061 2.952339 -0.27655
H  -3.001273 -1.952354 0.176621
H  -5.415741 -2.71273 0.39378
H  3.035123 -4.107788 2.052232
H  -8.187248 -0.221101 -0.104213
H  -7.83769 -1.91497 0.240802
H  4.674739 0.310591 -1.993811
H  1.789181 2.767844 0.142971
H  6.236469 2.610383 0.869315
