program: Gaussian 09
title: 000065268
version: EM64L-G09RevD.01
frameworkgroup: C1[X(C9H18N2O4)]
method: RPBEPBE
basis: SDD
operation: Freq
keyword: #p
keyword: freq=noraman
keyword: PBEPBE/SDD
title: #p freq=noraman PBEPBE/SDD
converged: NO YES NO NO
title: Mulliken charges:
elementType: O O O O N N C C C C C C C C C H H H H H H H H H H H H H H H H H H
charge: -0.327182 -0.327244 -0.379091 -0.379040 -0.326873 -0.326809 -0.385811 -0.367880 -0.367818 -0.372421 -0.372261 -0.503015 -0.503053 0.287715 0.287702 0.201316 0.201376 0.192038 0.192698 0.192748 0.191917 0.205943 0.241124 0.205840 0.241049 0.234677 0.203744 0.203638 0.234809 0.331311 0.331312 0.378791 0.378751
chargesum: 0.00000
title: Mulliken charges with hydrogens summed into heavy atoms:
elementType: O O O O N N C C C C C C C C C
charge: -0.327182 -0.327244 -0.000300 -0.000289 0.004438 0.004503 0.016881 0.016856 0.016846 0.074646 0.074628 -0.064595 -0.064606 0.287715 0.287702
polarizability: 1.84129018e+02 2.35932789e-01 1.04249380e+02 1.27433643e+01 6.65604348e-02 1.06293041e+02
1716.lowfreq: -3.9831 0.0000 0.0002 0.0008 4.7081 14.8415 25.3844 26.0029 33.7817
frequency: 19.3415 25.3838 33.7295 38.7260 57.1937 89.0734 92.5691 101.6486 133.1737 144.4150 151.1453 170.9886 190.9824 226.2806 251.9161 278.4084 278.6902 362.0464 370.4223 377.9664 397.5447 452.2556 462.0823 508.8055 509.7180 619.9877 627.0319 721.1558 725.5045 727.8331 738.8731 765.2728 819.3267 890.6750 929.6708 936.0993 968.6866 990.1487 990.6133 1009.2544 1022.9479 1050.9587 1074.1310 1080.6897 1080.7339 1094.9497 1106.9617 1191.8300 1208.9741 1213.5599 1232.2854 1255.6562 1263.7127 1285.2498 1285.3740 1294.6775 1298.3486 1301.5187 1323.8837 1345.5325 1358.0360 1359.4802 1368.6817 1369.2563 1446.3523 1446.5498 1465.3841 1465.5358 1473.6731 1483.6234 1490.1666 1490.7231 1490.9010 1571.3590 1571.5714 2951.9742 2953.7803 2966.2859 2976.8641 2977.1686 2986.6606 2988.2352 2992.2258 3001.9868 3027.1989 3030.5897 3035.3612 3062.7445 3065.1674 3223.7172 3224.3911 3620.2207 3620.5655
redmass: 6.5686 7.1987 4.7448 5.3485 3.2262 4.8812 2.0796 2.5287 3.4976 2.4215 2.0524 8.0792 6.1241 3.8609 4.0822 4.1074 4.2513 2.9236 1.3829 1.6213 3.5526 2.7093 2.4875 1.1678 1.1707 2.8276 2.8225 4.6363 3.5094 1.0837 1.2103 1.2233 1.3409 1.5041 4.8792 4.2530 3.4524 5.2822 1.7313 5.1838 3.4712 2.9381 2.4782 4.1885 2.3341 1.5334 1.2806 1.5797 1.4332 1.2582 1.3504 1.2800 1.2907 1.0325 1.1806 1.2700 1.1222 1.1269 1.3673 1.4456 1.5504 1.6826 2.1314 2.1758 1.1175 1.1183 1.0747 1.0668 1.0868 1.1011 1.2971 1.9814 1.5940 3.4880 3.5032 1.0590 1.0587 1.0594 1.0593 1.0593 1.0718 1.0656 1.0869 1.0967 1.0988 1.0995 1.1041 1.1037 1.1035 1.0631 1.0631 1.0830 1.0830
irintensity: 1.7758 0.6955 5.7997 0.1755 0.3016 4.9469 1.2892 0.0599 0.0007 0.0015 0.3395 2.6561 16.4235 35.1667 14.0561 49.9881 0.1810 48.4499 90.7051 28.0008 0.7303 18.7058 33.2840 174.3426 168.0922 3.6822 9.6057 3.8448 3.1704 13.2444 1.3841 3.5715 0.8180 13.4975 11.0325 30.5783 0.0301 112.9376 5.5610 32.5989 2.1832 25.4955 0.0130 0.8164 0.2995 15.5463 11.7092 8.2579 2.8865 33.1528 0.5208 0.0171 1.1868 0.2253 41.2125 5.0110 16.6376 0.5495 10.5346 39.0353 4.4176 7.3235 281.5163 44.9526 22.9988 4.9096 0.2307 0.5773 3.6005 1.9034 75.7254 110.1809 8.6243 107.6743 74.7078 0.1511 20.3562 53.1714 6.7407 11.8138 4.4326 87.6292 7.9823 7.2111 40.3812 0.1450 9.6018 0.5980 142.0204 29.3646 29.5612 67.2847 60.6625
temp: 298.150 k
press: 1.00000 atm
elementType: 8 8 8 8 7 7 6 6 6 6 6 6 6 6 6 1 1 1 1 1 1 1 1 1 1 1 1 1 1 1 1 1 1
symmnumber: 1
zpe: 716282.3 jmol-1
zpe.correction: 0.272818 hartree
zpe.thermalcorrener: 0.291177 hartree
zpe.thermalcorrenthalpy: 0.292121 hartree
zpe.thermalcorrgfe: 0.222866 hartree
zpe.sumelectzpe: -762.861303 hartree
zpe.sumelectthermal: -762.842944 hartree
zpe.sumelectthermalent: -762.842000 hartree
zpe.sumelectthermalfe: -762.911254 hartree
dipole: 0.0146 4.7578 -0.0690
dipole: 4.7583
quadrupole: -126.3967 -90.0989 -92.0056
quadrupole: 0.3364 19.9588 -0.0263
quadrupole: -23.5629 12.7348 10.8281 0.3364 19.9588 -0.0263
hfenergy: -763.1341205 hartree
pointgroup: C01 [X(C9H18N2O4)]
dipole: 0.0054863 -0.0459522 1.8714839 debye
polarizability: 182.7537503|-16.3549748|107.6697777|-0.3396728|0.0421274|104.2479116 unknown
InChI: InChI=1S/C9H18N2O4/c12-8(10-14)6-4-2-1-3-5-7-9(13)11-15/h10-11,14-15H,1-7H2
charge 0 multiplicity 1
33 atoms
O  5.314499 0.959407 -0.956635
O  -5.315399 -0.916398 -1.002071
O  7.298884 -0.777823 -0.738554
O  -7.289639 0.821018 -0.704843
N  6.102477 -0.924187 0.047809
N  -6.09558 0.91986 0.092423
C  0.001347 -0.007006 -0.121222
C  1.290461 -0.068921 0.728563
C  -1.287355 0.020255 0.731003
C  2.572425 -0.077719 -0.131772
C  -2.569572 0.06692 -0.127699
C  3.859447 -0.151781 0.7279
C  -3.856323 0.105297 0.734622
C  5.112937 0.012635 -0.113861
C  -5.11035 -0.012651 -0.113994
H  0.033275 0.893407 -0.76877
H  -0.030926 -0.880216 -0.804967
H  1.262896 -0.974984 1.369929
H  1.317549 0.801244 1.417733
H  -1.314967 -0.87795 1.383207
H  -1.258694 0.898656 1.409699
H  2.547162 -0.936382 -0.831897
H  2.622188 0.8362 -0.752828
H  -2.543585 0.954891 -0.790317
H  -2.620278 -0.819184 -0.787747
H  3.844224 0.671714 1.469206
H  3.890642 -1.101691 1.29777
H  -3.883017 1.02685 1.349548
H  -3.845228 -0.752841 1.435586
H  6.129284 -1.748148 0.644575
H  -6.117782 1.71556 0.72661
H  7.070029 0.065103 -1.255113
H  -7.062929 0.004668 -1.263194
