program: Orca
programVersion: 5.0.4
elementType: Cl S S P O O C C C C C H H H H H H H H H H H H
charge: 0
multiplicity: 1
keywords: wb97x-d3
keywords: def2-TZVPP
keywords: def2/J RIJCOSX
keywords: DEFGRID2
keywords: scfconv7
keywords: smallprint printgap noloewdin
keywords: NOSOSCF
formula: C5H12ClO2PS2
InChI: InChI=1/C5H12ClO2PS2/c1-3-7-9(10,8-4-2)11-5-6/h3-5H2,1-2H3
23 atoms
Cl -2.431762 0.31702 -1.817078
S  -1.55142 0.568977 1.059655
S  1.291151 -0.563368 2.198095
P  0.429929 0.081211 0.604171
O  0.435671 -0.909938 -0.64583
O  0.928152 1.440438 -0.063094
C  0.442775 -2.344284 -0.530064
C  1.974705 1.53641 -1.055452
C  -0.882935 -2.904069 -0.078202
C  3.332668 1.157641 -0.520818
C  -2.147496 1.398339 -0.426218
H  0.692851 -2.697428 -1.529557
H  1.246152 -2.647005 0.144382
H  1.707757 0.936027 -1.925853
H  1.9593 2.582093 -1.359355
H  -0.842019 -3.992411 -0.141562
H  -1.107699 -2.644244 0.956388
H  -1.702195 -2.561545 -0.709508
H  4.081876 1.378706 -1.282595
H  3.585723 1.729411 0.371968
H  3.405574 0.095626 -0.285753
H  -3.10052 1.848262 -0.153776
H  -1.465792 2.184024 -0.737794
elementType: Cl S P O C H
totalener: -1946.33314570 hartree
nucrepener: 1177.28839677 hartree
electener: -3123.62154247 hartree
oneelecener: -5026.89962245 hartree
twoeener: 1903.27807998 hartree
cpcmener: -0.01555912 hartree
kineticenergy: 1941.97332049 hartree
xcener: -109.900204117139 hartree
chargesum: 0.0000000
charge: -0.143862 -0.111530 -0.437509 0.625562 -0.323669 -0.354019 0.038481 0.046301 -0.241412 -0.247099 -0.117185 0.108129 0.094129 0.097181 0.106904 0.101806 0.075852 0.084236 0.098225 0.091404 0.079893 0.173346 0.154832
qa: -0.1439 -0.1115 -0.4375 0.6256 -0.3237 -0.3540 0.0385 0.0463 -0.2414 -0.2471 -0.1172 0.1081 0.0941 0.0972 0.1069 0.1018 0.0759 0.0842 0.0982 0.0914 0.0799 0.1733 0.1548
va: 1.1280 2.3248 2.0263 5.4368 2.0736 2.1024 3.8419 3.8568 3.9093 3.9322 4.0602 0.9899 1.0147 1.0013 0.9868 1.0139 1.0144 1.0148 1.0103 1.0058 1.0127 0.9850 1.0056
dispcorr: -0.011134189 hartree
energy: -1946.344279893701
dipole: 11.54387 -11.44872 0.09515 -4.22550 4.60346 0.37796 -4.80498 3.06455 -1.74043
magnitude: 1.78354 au
magnitude: 4.53339 debye
