program: Orca
programVersion: 5.0.4
elementType: Cl S S P O O C C C C C H H H H H H H H H H H H
charge: 0
multiplicity: 1
keywords: wb97x-d3
keywords: def2-TZVPP
keywords: def2/J RIJCOSX
keywords: DEFGRID2
keywords: scfconv7
keywords: smallprint printgap noloewdin
keywords: NOSOSCF
formula: C5H12ClO2PS2
InChI: InChI=1/C5H12ClO2PS2/c1-3-7-9(10,8-4-2)11-5-6/h3-5H2,1-2H3
23 atoms
Cl -3.040593 -0.345966 0.181374
S  -0.769831 1.408796 -0.684304
S  0.677579 -0.347156 1.854816
P  0.629382 -0.010727 -0.036855
O  0.36148 -1.251167 -0.993432
O  1.951539 0.603624 -0.699018
C  0.644749 -2.606738 -0.609468
C  2.648078 1.69894 -0.089903
C  -0.621877 -3.31298 -0.190524
C  4.1342 1.471644 -0.225609
C  -2.093413 1.124799 0.500453
H  1.088282 -3.071579 -1.490031
H  1.384795 -2.631854 0.193233
H  2.341027 2.618655 -0.592468
H  2.372077 1.78359 0.964543
H  -1.040738 -2.864276 0.708847
H  -1.37356 -3.274659 -0.9779
H  -0.403721 -4.360308 0.020179
H  4.444425 0.576126 0.311348
H  4.430819 1.371077 -1.268988
H  4.672922 2.320258 0.196386
H  -1.680631 1.052264 1.504905
H  -2.757983 1.983333 0.432205
totalener: -1946.31980202 hartree
nucrepener: 1162.87872566 hartree
electener: -3109.19852768 hartree
oneelecener: -4997.85010590 hartree
twoeener: 1888.65157823 hartree
kineticenergy: 1942.02481093 hartree
xcener: -109.906754884824 hartree
chargesum: 0.0000000
charge: -0.112553 -0.105282 -0.399843 0.609026 -0.300413 -0.322649 0.040683 0.017664 -0.233354 -0.222730 -0.122856 0.095304 0.080705 0.092886 0.085774 0.080613 0.091103 0.084106 0.083965 0.086783 0.077061 0.145525 0.148480
qa: -0.1126 -0.1053 -0.3998 0.6090 -0.3004 -0.3226 0.0407 0.0177 -0.2334 -0.2227 -0.1229 0.0953 0.0807 0.0929 0.0858 0.0806 0.0911 0.0841 0.0840 0.0868 0.0771 0.1455 0.1485
va: 1.1541 2.3287 2.0379 5.4526 2.1366 2.1298 3.8618 3.8780 3.9194 3.9600 4.0637 0.9945 1.0148 0.9931 1.0121 1.0217 1.0045 1.0142 1.0107 1.0049 1.0091 1.0269 0.9895
dispcorr: -0.009830008 hartree
energy: -1946.329632025480
dipole: 15.58991 -15.04309 0.54682 -3.28885 3.62930 0.34045 -0.58740 0.39202 -0.19538
magnitude: 0.67312 au
magnitude: 1.71093 debye
