program: Orca
programVersion: 5.0.4
elementType: Cl S S P O O C C C C C H H H H H H H H H H H H
charge: 0
multiplicity: 1
keywords: wb97x-d3
keywords: def2-TZVPP
keywords: def2/J RIJCOSX
keywords: DEFGRID2
keywords: scfconv7
keywords: smallprint printgap noloewdin
keywords: NOSOSCF
formula: C5H12ClO2PS2
InChI: InChI=1/C5H12ClO2PS2/c1-3-7-9(10,8-4-2)11-5-6/h3-5H2,1-2H3
23 atoms
Cl -3.253655 -0.178118 -0.206243
S  -0.593336 0.856293 -1.120848
S  0.064495 0.684343 2.214674
P  0.419535 -0.063857 0.492428
O  0.149354 -1.624936 0.397647
O  1.915949 0.05649 -0.074157
C  -0.18254 -2.368669 -0.782173
C  2.672348 1.261617 0.092048
C  0.948412 -2.466385 -1.780362
C  4.078447 1.006644 -0.392879
C  -2.17222 1.230105 -0.345591
H  -0.449604 -3.356418 -0.408983
H  -1.073249 -1.93793 -1.243203
H  2.203742 2.068923 -0.478443
H  2.665872 1.551798 1.144929
H  0.661151 -3.161304 -2.570119
H  1.168922 -1.50923 -2.251035
H  1.860384 -2.839902 -1.316846
H  4.555534 0.212723 0.180283
H  4.095405 0.730209 -1.446412
H  4.673847 1.91154 -0.273532
H  -2.003641 1.628514 0.653525
H  -2.660863 1.975995 -0.968056
totalener: -1946.31820652 hartree
nucrepener: 1165.93333626 hartree
electener: -3112.25154278 hartree
oneelecener: -5003.75857215 hartree
twoeener: 1891.50702937 hartree
kineticenergy: 1942.01316375 hartree
xcener: -109.906210042012 hartree
chargesum: -0.0000000
charge: -0.113767 -0.147084 -0.366316 0.604712 -0.293882 -0.315018 0.012081 0.020774 -0.218377 -0.228917 -0.113021 0.100614 0.081726 0.085382 0.097690 0.086247 0.070939 0.093408 0.087623 0.082221 0.078542 0.146281 0.148143
qa: -0.1138 -0.1471 -0.3663 0.6047 -0.2939 -0.3150 0.0121 0.0208 -0.2184 -0.2289 -0.1130 0.1006 0.0817 0.0854 0.0977 0.0862 0.0709 0.0934 0.0876 0.0822 0.0785 0.1463 0.1481
va: 1.1565 2.2915 2.1029 5.4545 2.1556 2.1061 3.8936 3.8741 3.9044 3.9615 4.0558 0.9915 1.0167 0.9955 1.0078 1.0111 1.0169 1.0062 1.0066 1.0051 1.0085 1.0319 0.9896
dispcorr: -0.010070208 hartree
energy: -1946.328276726919
dipole: 19.00476 -18.39032 0.61444 -2.22115 2.43310 0.21195 -8.63556 7.38349 -1.25207
magnitude: 1.41072 au
magnitude: 3.58577 debye
