program: Orca
programVersion: 5.0.4
elementType: Cl Cl Cl P O O O O C C C C C C C C C C C C H H H H H H H H H H H H H H
charge: 0
multiplicity: 1
keywords: wb97x-d3
keywords: def2-TZVPP
keywords: def2/J RIJCOSX
keywords: DEFGRID2
keywords: scfconv7
keywords: smallprint printgap noloewdin
keywords: NOSOSCF
formula: C12H14Cl3O4P
InChI: InChI=1/C12H14Cl3O4P/c1-3-17-20(16,18-4-2)19-12(8-13)10-6-5-9(14)7-11(10)15/h5-8H,3-4H2,1-2H3
34 atoms
Cl -0.022192 -0.11961 2.802333
Cl -4.024907 2.671321 0.592096
Cl -1.691229 -3.66107 0.324833
P  1.799913 0.02183 -0.81794
O  1.374709 -1.212818 0.146292
O  1.534409 1.284002 0.09428
O  3.374568 -0.103773 -0.766639
O  1.148652 -0.00416 -2.14539
C  -0.976317 -0.626394 0.3283
C  0.06937 -1.656642 0.197283
C  1.03203 2.533936 -0.430063
C  4.062304 -1.105484 -1.558211
C  -1.074754 0.168464 1.467074
C  -1.853951 -0.38524 -0.723451
C  2.101675 3.30243 -1.164367
C  4.497939 -0.538344 -2.884866
C  -2.010392 1.183839 1.564252
C  -2.801797 0.620145 -0.651677
C  -2.861394 1.399835 0.491877
C  -0.130158 -2.966582 0.146943
H  0.166114 2.344349 -1.066192
H  0.688898 3.080342 0.446198
H  4.918644 -1.406261 -0.957689
H  3.431273 -1.986448 -1.692699
H  -1.788771 -0.991008 -1.617042
H  1.703538 4.274481 -1.455814
H  2.973391 3.472689 -0.532992
H  2.421347 2.791345 -2.073346
H  3.646892 -0.252447 -3.502121
H  5.143855 0.329458 -2.754014
H  5.062877 -1.297447 -3.426492
H  -2.073994 1.790427 2.456796
H  -3.474385 0.795291 -1.479207
H  0.677314 -3.675471 0.019069
elementType: Cl P O C H
totalener: -2488.78900604 hartree
nucrepener: 2312.37434331 hartree
electener: -4801.16334935 hartree
oneelecener: -8029.18391703 hartree
twoeener: 3228.02056767 hartree
cpcmener: -0.02820603 hartree
kineticenergy: 2482.72960921 hartree
xcener: -152.817035717428 hartree
chargesum: 0.0000000
charge: -0.061727 -0.076453 -0.077092 0.963146 -0.327472 -0.349109 -0.365693 -0.627946 0.019086 0.077839 0.048496 0.053908 0.057710 -0.155495 -0.249214 -0.252380 -0.128193 -0.142786 0.095482 -0.061862 0.101251 0.110001 0.107255 0.097985 0.160326 0.098983 0.092867 0.085532 0.081704 0.090238 0.098419 0.127492 0.149328 0.158374
qa: -0.0617 -0.0765 -0.0771 0.9631 -0.3275 -0.3491 -0.3657 -0.6279 0.0191 0.0778 0.0485 0.0539 0.0577 -0.1555 -0.2492 -0.2524 -0.1282 -0.1428 0.0955 -0.0619 0.1013 0.1100 0.1073 0.0980 0.1603 0.0990 0.0929 0.0855 0.0817 0.0902 0.0984 0.1275 0.1493 0.1584
va: 1.2632 1.2267 1.2398 5.5791 2.1078 2.0940 2.1142 1.9277 3.5471 3.8953 3.8255 3.8610 3.9193 3.9493 3.9572 3.9319 4.0145 3.9882 3.8635 4.0570 0.9963 0.9879 0.9927 0.9987 1.0023 1.0076 1.0045 1.0103 1.0170 1.0028 1.0079 1.0194 1.0027 0.9978
dispcorr: -0.020857893 hartree
energy: -2488.809863935264
dipole: 28.35022 -27.45192 0.89830 10.31975 -9.94310 0.37665 -21.01550 20.55812 -0.45738
magnitude: 1.07611 au
magnitude: 2.73525 debye
