program: Orca
programVersion: 5.0.4
elementType: Cl Cl Cl P O O O O C C C C C C C C C C C C H H H H H H H H H H H H H H
charge: 0
multiplicity: 1
keywords: wb97x-d3
keywords: def2-TZVPP
keywords: def2/J RIJCOSX
keywords: DEFGRID2
keywords: scfconv7
keywords: smallprint printgap noloewdin
keywords: NOSOSCF
formula: C12H14Cl3O4P
InChI: InChI=1/C12H14Cl3O4P/c1-3-17-20(16,18-4-2)19-12(8-13)10-6-5-9(14)7-11(10)15/h5-8H,3-4H2,1-2H3
34 atoms
Cl -1.588641 0.915089 2.09209
Cl -4.044223 0.746707 -2.647442
Cl -1.466793 -2.390762 2.804228
P  2.065669 0.172958 -0.012189
O  1.479805 -1.256823 0.478694
O  3.581397 -0.271451 -0.021345
O  1.675855 0.286674 -1.546202
O  1.656873 1.310159 0.837688
C  -0.881595 -0.837572 0.141327
C  0.201424 -1.36147 0.992166
C  4.615547 0.472921 -0.705424
C  0.87703 1.364381 -2.088363
C  -1.732537 0.193535 0.534268
C  -1.028714 -1.356243 -1.144914
C  4.928151 1.790022 -0.040217
C  1.739931 2.53531 -2.484416
C  -2.710233 0.685389 -0.317701
C  -1.996727 -0.884809 -2.010118
C  -2.830142 0.136945 -1.582232
C  0.068694 -2.013162 2.139684
H  5.481798 -0.184917 -0.682943
H  4.332992 0.615205 -1.74999
H  0.379347 0.93643 -2.956529
H  0.106272 1.659944 -1.375423
H  -0.375333 -2.154339 -1.472146
H  5.812189 2.216359 -0.514244
H  4.119648 2.512984 -0.144592
H  5.148217 1.659721 1.019118
H  1.114154 3.294457 -2.954498
H  2.226866 2.992366 -1.622576
H  2.504344 2.241874 -3.203959
H  -3.359533 1.488601 0.00161
H  -2.096687 -1.307292 -2.999909
H  0.917429 -2.377478 2.702836
elementType: Cl P O C H
totalener: -2488.78719900 hartree
nucrepener: 2317.31505530 hartree
electener: -4806.10225430 hartree
oneelecener: -8038.98903033 hartree
twoeener: 3232.88677603 hartree
cpcmener: -0.03233247 hartree
kineticenergy: 2482.71888581 hartree
xcener: -152.818591981899 hartree
chargesum: 0.0000000
charge: -0.056622 -0.076200 -0.074169 0.939349 -0.335609 -0.348770 -0.355219 -0.622837 0.022553 0.096405 0.022222 0.057571 0.024660 -0.105659 -0.249400 -0.271281 -0.137335 -0.175042 0.117673 -0.071820 0.116041 0.106624 0.116131 0.103244 0.151798 0.099777 0.083847 0.095046 0.107088 0.089965 0.094656 0.126635 0.149755 0.158922
qa: -0.0566 -0.0762 -0.0742 0.9393 -0.3356 -0.3488 -0.3552 -0.6228 0.0226 0.0964 0.0222 0.0576 0.0247 -0.1057 -0.2494 -0.2713 -0.1373 -0.1750 0.1177 -0.0718 0.1160 0.1066 0.1161 0.1032 0.1518 0.0998 0.0838 0.0950 0.1071 0.0900 0.0947 0.1266 0.1498 0.1589
va: 1.2630 1.2271 1.2487 5.6028 2.1185 2.1316 2.0546 1.9435 3.5517 3.8470 3.8634 3.7963 3.9332 3.8622 3.9102 3.9764 4.0440 3.9642 3.8443 4.0669 0.9902 0.9963 0.9869 0.9920 1.0050 1.0073 1.0075 1.0061 1.0096 1.0030 1.0017 1.0207 1.0032 0.9973
dispcorr: -0.021442782 hartree
energy: -2488.808641777509
dipole: 32.76610 -31.64156 1.12454 13.50882 -13.51821 -0.00939 -17.52701 15.15849 -2.36852
magnitude: 2.62194 au
magnitude: 6.66444 debye
