program: Orca
programVersion: 5.0.4
elementType: Cl Cl Cl P O O O O C C C C C C C C C C C C H H H H H H H H H H H H H H
charge: 0
multiplicity: 1
keywords: wb97x-d3
keywords: def2-TZVPP
keywords: def2/J RIJCOSX
keywords: DEFGRID2
keywords: scfconv7
keywords: smallprint printgap noloewdin
keywords: NOSOSCF
formula: C12H14Cl3O4P
InChI: InChI=1/C12H14Cl3O4P/c1-3-17-20(16,18-4-2)19-12(8-13)10-6-5-9(14)7-11(10)15/h5-8H,3-4H2,1-2H3
34 atoms
Cl -0.527933 0.077617 2.894125
Cl -4.683535 1.979039 0.099975
Cl -0.712385 -3.549208 -0.11572
P  2.236452 0.373791 -0.705056
O  1.502791 -0.355988 0.544367
O  3.148652 1.417421 0.053882
O  3.277603 -0.723024 -1.17178
O  1.314587 0.899625 -1.734019
C  -0.888018 -0.436311 0.265549
C  0.399392 -1.15203 0.291742
C  2.708204 2.778527 0.282777
C  3.486756 -1.043651 -2.567481
C  -1.374217 0.215259 1.395941
C  -1.619952 -0.34101 -0.913698
C  1.522057 2.87726 1.210442
C  2.541827 -2.12574 -3.023821
C  -2.540947 0.960525 1.361061
C  -2.793011 0.390019 -0.97519
C  -3.234525 1.042458 0.164725
C  0.587657 -2.453361 0.116987
H  3.575867 3.274178 0.712573
H  2.495872 3.249649 -0.677833
H  3.387433 -0.146573 -3.179488
H  4.521905 -1.374045 -2.630037
H  -1.257862 -0.836547 -1.804529
H  0.610852 2.474197 0.767299
H  1.707269 2.374054 2.15863
H  1.339569 3.931153 1.421943
H  2.655255 -3.031863 -2.428525
H  1.501375 -1.802433 -2.975585
H  2.765736 -2.377732 -4.060855
H  -2.900434 1.462556 2.248482
H  -3.344759 0.45926 -1.901938
H  1.56948 -2.907823 0.133889
elementType: Cl P O C H
totalener: -2488.78873117 hartree
nucrepener: 2299.46213506 hartree
electener: -4788.25086623 hartree
oneelecener: -8003.41192201 hartree
twoeener: 3215.16105578 hartree
cpcmener: -0.02786994 hartree
kineticenergy: 2482.72333647 hartree
xcener: -152.815601877401 hartree
chargesum: 0.0000000
charge: -0.065550 -0.078221 -0.071051 0.975290 -0.335086 -0.361760 -0.368937 -0.634856 0.060953 0.116276 0.044143 0.054770 -0.001215 -0.171831 -0.252837 -0.258386 -0.114464 -0.139204 0.087745 -0.059584 0.108689 0.102705 0.098147 0.107006 0.165041 0.083765 0.086352 0.105502 0.089949 0.081152 0.108951 0.127942 0.148830 0.159772
qa: -0.0655 -0.0782 -0.0711 0.9753 -0.3351 -0.3618 -0.3689 -0.6349 0.0610 0.1163 0.0441 0.0548 -0.0012 -0.1718 -0.2528 -0.2584 -0.1145 -0.1392 0.0877 -0.0596 0.1087 0.1027 0.0981 0.1070 0.1650 0.0838 0.0864 0.1055 0.0899 0.0812 0.1090 0.1279 0.1488 0.1598
va: 1.2560 1.2250 1.2458 5.5596 2.0697 2.1165 2.1011 1.9181 3.5450 3.8334 3.8518 3.8420 3.9610 3.9383 3.9022 3.9231 4.0303 4.0021 3.8800 4.0945 0.9915 1.0001 1.0021 0.9941 0.9917 1.0069 1.0118 1.0094 1.0016 1.0085 1.0097 1.0190 1.0032 0.9988
dispcorr: -0.021120218 hartree
energy: -2488.809851388467
dipole: 23.30201 -22.29856 1.00345 6.33065 -6.27666 0.05400 -14.78026 14.13231 -0.64795
magnitude: 1.19569 au
magnitude: 3.03919 debye
