program: Orca
programVersion: 5.0.4
elementType: Cl Cl Cl P O O O O C C C C C C C C C C C C H H H H H H H H H H H H H H
charge: 0
multiplicity: 1
keywords: wb97x-d3
keywords: def2-TZVPP
keywords: def2/J RIJCOSX
keywords: DEFGRID2
keywords: scfconv7
keywords: smallprint printgap noloewdin
keywords: NOSOSCF
formula: C12H14Cl3O4P
InChI: InChI=1/C12H14Cl3O4P/c1-3-17-20(16,18-4-2)19-12(8-13)10-6-5-9(14)7-11(10)15/h5-8H,3-4H2,1-2H3
34 atoms
Cl -1.134369 1.368644 1.838163
Cl -4.411559 0.460828 -2.29335
Cl -1.155177 -1.847522 3.14389
P  2.336465 0.175658 0.193758
O  1.486043 -1.198895 0.303842
O  3.565776 -0.286722 -0.679085
O  1.382002 1.07175 -0.702361
O  2.741696 0.740231 1.496292
C  -0.889003 -0.786826 0.218891
C  0.288665 -1.210391 0.996629
C  3.569518 -0.481395 -2.113557
C  1.393113 2.517277 -0.647657
C  -1.61049 0.365583 0.517127
C  -1.270368 -1.532164 -0.893055
C  2.675486 -1.602527 -2.582251
C  2.586847 3.1035 -1.357841
C  -2.697559 0.75841 -0.246924
C  -2.35162 -1.163145 -1.672774
C  -3.057109 -0.018866 -1.33528
C  0.291146 -1.667582 2.240692
H  3.311207 0.45931 -2.600556
H  4.609028 -0.701888 -2.34672
H  0.464736 2.817255 -1.129723
H  1.351415 2.842713 0.39208
H  -0.715113 -2.425504 -1.148073
H  1.616149 -1.371192 -2.474312
H  2.866202 -1.763886 -3.643578
H  2.890072 -2.535829 -2.062205
H  3.525466 2.846518 -0.864009
H  2.635275 2.777329 -2.397102
H  2.500051 4.190773 -1.352427
H  -3.24574 1.65724 -0.001494
H  -2.637497 -1.76134 -2.526354
H  1.194942 -1.974906 2.749902
elementType: Cl P O C H
totalener: -2488.78827142 hartree
nucrepener: 2324.64305134 hartree
electener: -4813.43132276 hartree
oneelecener: -8053.40524160 hartree
twoeener: 3239.97391885 hartree
cpcmener: -0.03443341 hartree
kineticenergy: 2482.71722830 hartree
xcener: -152.817066224203 hartree
chargesum: -0.0000000
charge: -0.066975 -0.078321 -0.069625 0.911825 -0.334519 -0.354691 -0.337819 -0.634913 0.044613 0.115799 0.036574 0.056469 0.001438 -0.162225 -0.245224 -0.267415 -0.107521 -0.143360 0.087458 -0.042246 0.107353 0.110805 0.107714 0.095502 0.156771 0.081692 0.103859 0.092994 0.095605 0.092808 0.106520 0.129844 0.150369 0.158844
qa: -0.0670 -0.0783 -0.0696 0.9118 -0.3345 -0.3547 -0.3378 -0.6349 0.0446 0.1158 0.0366 0.0565 0.0014 -0.1622 -0.2452 -0.2674 -0.1075 -0.1434 0.0875 -0.0422 0.1074 0.1108 0.1077 0.0955 0.1568 0.0817 0.1039 0.0930 0.0956 0.0928 0.1065 0.1298 0.1504 0.1588
va: 1.2537 1.2246 1.2536 5.6023 2.0848 2.1093 2.0468 1.9733 3.5871 3.8099 3.8525 3.8118 3.9065 3.9357 3.9067 3.9500 4.0155 3.9892 3.8769 4.1065 0.9890 0.9907 0.9869 1.0085 0.9973 1.0063 1.0093 1.0062 1.0085 1.0003 1.0092 1.0173 1.0018 0.9971
dispcorr: -0.021244043 hartree
energy: -2488.809515458172
dipole: 26.39666 -26.43087 -0.03421 4.74302 -4.84739 -0.10436 -22.11582 19.17506 -2.94077
magnitude: 2.94282 au
magnitude: 7.48005 debye
