program: Orca
programVersion: 5.0.4
elementType: Cl Cl Cl P O O O O C C C C C C C C C C C C H H H H H H H H H H H H H H
charge: 0
multiplicity: 1
keywords: wb97x-d3
keywords: def2-TZVPP
keywords: def2/J RIJCOSX
keywords: DEFGRID2
keywords: scfconv7
keywords: smallprint printgap noloewdin
keywords: NOSOSCF
formula: C12H14Cl3O4P
InChI: InChI=1/C12H14Cl3O4P/c1-3-17-20(16,18-4-2)19-12(8-13)10-6-5-9(14)7-11(10)15/h5-8H,3-4H2,1-2H3
34 atoms
Cl -0.25519 0.125694 2.695433
Cl -4.308144 2.319832 -0.002675
Cl -1.069591 -3.13199 2.082651
P  1.762773 -0.116245 -1.228644
O  1.166376 -1.521031 -0.700198
O  1.884308 0.683442 0.131309
O  3.235919 -0.570298 -1.589918
O  1.01465 0.533013 -2.326943
C  -0.941195 -0.663957 0.191737
C  0.146647 -1.657369 0.218952
C  2.179673 2.102062 0.129548
C  3.769955 -0.494254 -2.932893
C  -1.217628 0.177362 1.267225
C  -1.723514 -0.543888 -0.955147
C  0.920156 2.930215 0.14778
C  4.279373 0.887664 -3.255072
C  -2.251335 1.098705 1.216289
C  -2.761419 0.366164 -1.029944
C  -3.015386 1.177614 0.064661
C  0.194565 -2.735072 0.992024
H  2.771074 2.270596 1.027499
H  2.808121 2.357894 -0.726879
H  4.580773 -1.220093 -2.94878
H  3.018811 -0.819757 -3.653122
H  -1.526757 -1.18944 -1.800902
H  1.195662 3.9853 0.154085
H  0.301602 2.752358 -0.731385
H  0.326655 2.737405 1.04079
H  4.753744 0.870165 -4.23671
H  3.474695 1.622076 -3.288733
H  5.024109 1.216968 -2.530486
H  -2.448532 1.747034 2.058555
H  -3.361925 0.435315 -1.925849
H  1.016683 -3.437863 0.96422
elementType: Cl P O C H
totalener: -2488.78644474 hartree
nucrepener: 2320.83423020 hartree
electener: -4809.62067494 hartree
oneelecener: -8046.34391927 hartree
twoeener: 3236.72324433 hartree
cpcmener: -0.02837318 hartree
kineticenergy: 2482.71324974 hartree
xcener: -152.818713686939 hartree
chargesum: 0.0000000
charge: -0.058192 -0.076532 -0.076237 0.951775 -0.322740 -0.333759 -0.366206 -0.631165 0.037898 0.140755 0.033620 0.058217 -0.017560 -0.186674 -0.246119 -0.261266 -0.109481 -0.124440 0.091798 -0.078338 0.113309 0.105096 0.106855 0.096850 0.159135 0.110947 0.082692 0.082259 0.103409 0.084789 0.091354 0.128939 0.150471 0.158541
qa: -0.0582 -0.0765 -0.0762 0.9518 -0.3227 -0.3338 -0.3662 -0.6312 0.0379 0.1408 0.0336 0.0582 -0.0176 -0.1867 -0.2461 -0.2613 -0.1095 -0.1244 0.0918 -0.0783 0.1133 0.1051 0.1069 0.0968 0.1591 0.1109 0.0827 0.0823 0.1034 0.0848 0.0914 0.1289 0.1505 0.1585
va: 1.2608 1.2270 1.2466 5.5794 2.1439 2.0818 2.1008 1.9208 3.5477 3.8295 3.8622 3.8334 3.9214 3.9271 3.9190 3.9135 3.9634 3.9770 3.8680 4.0369 0.9936 0.9924 0.9936 1.0030 1.0036 1.0110 1.0162 1.0053 1.0089 1.0138 1.0022 1.0199 1.0015 0.9987
dispcorr: -0.021232828 hartree
energy: -2488.807677565712
dipole: 26.93046 -25.46393 1.46653 13.44100 -12.94531 0.49569 -20.84311 20.31286 -0.53026
magnitude: 1.63634 au
magnitude: 4.15923 debye
