program: Orca
programVersion: 5.0.4
elementType: Cl Cl Cl P O O O O C C C C C C C C C C C C H H H H H H H H H H H H H H
charge: 0
multiplicity: 1
keywords: wb97x-d3
keywords: def2-TZVPP
keywords: def2/J RIJCOSX
keywords: DEFGRID2
keywords: scfconv7
keywords: smallprint printgap noloewdin
keywords: NOSOSCF
formula: C12H14Cl3O4P
InChI: InChI=1/C12H14Cl3O4P/c1-3-17-20(16,18-4-2)19-12(8-13)10-6-5-9(14)7-11(10)15/h5-8H,3-4H2,1-2H3
34 atoms
Cl -0.634335 0.652959 2.618018
Cl -4.811269 1.529131 -0.620909
Cl -0.786469 -3.586912 0.783498
P  1.811502 0.778011 -0.558056
O  1.524129 -0.429886 0.492422
O  3.349184 1.016602 -0.280984
O  1.735541 0.124458 -1.994099
O  0.922085 1.94854 -0.432227
C  -0.901504 -0.535227 0.208405
C  0.385991 -1.205966 0.45736
C  3.822364 2.022418 0.648945
C  2.443146 -1.08277 -2.375575
C  -1.452352 0.352713 1.127964
C  -1.588458 -0.769545 -0.97736
C  3.582992 1.640555 2.087832
C  2.510412 -1.131875 -3.877898
C  -2.653647 0.994693 0.885921
C  -2.793077 -0.142846 -1.245191
C  -3.311085 0.734659 -0.306705
C  0.544341 -2.505111 0.676768
H  4.886961 2.104475 0.441101
H  3.358852 2.980258 0.410592
H  3.445495 -1.081688 -1.945235
H  1.8999 -1.941944 -1.980026
H  -1.167953 -1.450233 -1.705985
H  4.065122 2.380013 2.727782
H  2.523037 1.629671 2.344153
H  4.012785 0.666877 2.3217
H  3.066587 -0.286665 -4.282479
H  3.023469 -2.045436 -4.177834
H  1.516046 -1.146146 -4.323971
H  -3.069478 1.680157 1.611267
H  -3.311748 -0.334178 -2.173888
H  1.515784 -2.955255 0.833464
elementType: Cl P O C H
totalener: -2488.78921491 hartree
nucrepener: 2298.42923808 hartree
electener: -4787.21845299 hartree
oneelecener: -8001.51273206 hartree
twoeener: 3214.29427908 hartree
cpcmener: -0.03432769 hartree
kineticenergy: 2482.70407997 hartree
xcener: -152.813102772100 hartree
chargesum: 0.0000000
charge: -0.063373 -0.076779 -0.077854 0.932192 -0.307340 -0.354433 -0.351995 -0.628618 0.019284 0.056421 0.036953 0.039429 0.050951 -0.121281 -0.240258 -0.246054 -0.146549 -0.163475 0.110772 -0.043506 0.109356 0.101002 0.114547 0.106635 0.163521 0.101087 0.078134 0.090767 0.090978 0.090237 0.089536 0.130714 0.149580 0.159415
qa: -0.0634 -0.0768 -0.0779 0.9322 -0.3073 -0.3544 -0.3520 -0.6286 0.0193 0.0564 0.0370 0.0394 0.0510 -0.1213 -0.2403 -0.2461 -0.1465 -0.1635 0.1108 -0.0435 0.1094 0.1010 0.1145 0.1066 0.1635 0.1011 0.0781 0.0908 0.0910 0.0902 0.0895 0.1307 0.1496 0.1594
va: 1.2612 1.2259 1.2393 5.5900 2.0614 2.1159 2.1043 1.9594 3.4874 3.8664 3.8532 3.8302 3.9208 3.9280 3.8993 3.9650 4.0758 4.0203 3.8645 4.0318 0.9904 1.0032 0.9964 0.9840 0.9926 1.0098 1.0152 1.0060 1.0050 1.0060 1.0027 1.0184 1.0030 0.9993
dispcorr: -0.020216721 hartree
energy: -2488.809431632872
dipole: 31.28958 -29.28767 2.00191 1.47505 -3.02199 -1.54693 -12.63594 12.00944 -0.62651
magnitude: 2.60637 au
magnitude: 6.62486 debye
