program: Orca
programVersion: 5.0.4
elementType: Cl Cl Cl P O O O O C C C C C C C C C C C C H H H H H H H H H H H H H H
charge: 0
multiplicity: 1
keywords: wb97x-d3
keywords: def2-TZVPP
keywords: def2/J RIJCOSX
keywords: DEFGRID2
keywords: scfconv7
keywords: smallprint printgap noloewdin
keywords: NOSOSCF
formula: C12H14Cl3O4P
InChI: InChI=1/C12H14Cl3O4P/c1-3-17-20(16,18-4-2)19-12(8-13)10-6-5-9(14)7-11(10)15/h5-8H,3-4H2,1-2H3
34 atoms
Cl -0.13433 0.162179 2.722354
Cl -4.484204 2.340837 0.478213
Cl -1.480515 -3.633425 0.427089
P  1.69222 0.128059 -1.082335
O  1.352756 -0.92855 0.109569
O  1.384824 1.566533 -0.517022
O  3.270216 0.058042 -1.101519
O  0.945714 -0.164453 -2.322288
C  -1.04596 -0.557293 0.284218
C  0.093145 -1.487926 0.192429
C  2.05664 2.167725 0.619096
C  3.972304 -1.052275 -1.717669
C  -1.225171 0.27063 1.388497
C  -1.96209 -0.469301 -0.75927
C  3.063958 3.188187 0.156253
C  4.300338 -0.746989 -3.15573
C  -2.276637 1.167975 1.462141
C  -3.024586 0.414867 -0.710989
C  -3.166863 1.227426 0.40205
C  0.011387 -2.811233 0.203303
H  1.269372 2.635682 1.207221
H  2.523461 1.402382 1.240023
H  4.8756 -1.180823 -1.125342
H  3.386541 -1.969091 -1.62983
H  -1.837867 -1.101683 -1.627728
H  3.872551 2.734969 -0.415965
H  2.596668 3.963019 -0.451042
H  3.502935 3.670236 1.030106
H  4.887323 -1.568318 -3.56746
H  3.402468 -0.641902 -3.763329
H  4.892465 0.163356 -3.244911
H  -2.401021 1.800418 2.329874
H  -3.724106 0.470013 -1.533014
H  0.878632 -3.450655 0.102874
elementType: Cl P O C H
totalener: -2488.78951660 hartree
nucrepener: 2291.88998256 hartree
electener: -4780.67949916 hartree
oneelecener: -7988.22718696 hartree
twoeener: 3207.54768780 hartree
cpcmener: -0.03063817 hartree
kineticenergy: 2482.71822359 hartree
xcener: -152.814212510421 hartree
chargesum: -0.0000000
charge: -0.066314 -0.077025 -0.077147 0.940786 -0.325707 -0.351201 -0.341124 -0.631174 0.034596 0.090188 0.050851 0.040562 0.038191 -0.150540 -0.258013 -0.244877 -0.122698 -0.147001 0.097771 -0.059944 0.103391 0.105423 0.108926 0.100591 0.160348 0.086443 0.090232 0.096597 0.097267 0.080716 0.089824 0.129933 0.150886 0.159244
qa: -0.0663 -0.0770 -0.0771 0.9408 -0.3257 -0.3512 -0.3411 -0.6312 0.0346 0.0902 0.0509 0.0406 0.0382 -0.1505 -0.2580 -0.2449 -0.1227 -0.1470 0.0978 -0.0599 0.1034 0.1054 0.1089 0.1006 0.1603 0.0864 0.0902 0.0966 0.0973 0.0807 0.0898 0.1299 0.1509 0.1592
va: 1.2565 1.2261 1.2400 5.5774 2.0549 2.0911 2.1124 1.9616 3.5266 3.8722 3.8157 3.8555 3.9361 3.9511 3.9771 3.9321 4.0387 4.0050 3.8734 4.0687 0.9910 0.9972 0.9931 0.9972 1.0050 1.0124 1.0030 1.0056 1.0076 1.0176 1.0035 1.0183 1.0020 0.9962
dispcorr: -0.020106776 hartree
energy: -2488.809623377063
dipole: 33.50034 -31.60331 1.89703 8.02197 -8.02196 0.00001 -14.75933 15.50381 0.74447
magnitude: 2.03788 au
magnitude: 5.17988 debye
