program: Orca
programVersion: 5.0.4
elementType: Cl Cl Cl P O O O O C C C C C C C C C C C C H H H H H H H H H H H H H H
charge: 0
multiplicity: 1
keywords: wb97x-d3
keywords: def2-TZVPP
keywords: def2/J RIJCOSX
keywords: DEFGRID2
keywords: scfconv7
keywords: smallprint printgap noloewdin
keywords: NOSOSCF
formula: C12H14Cl3O4P
InChI: InChI=1/C12H14Cl3O4P/c1-3-17-20(16,18-4-2)19-12(8-13)10-6-5-9(14)7-11(10)15/h5-8H,3-4H2,1-2H3
34 atoms
Cl -1.081474 1.771382 1.977798
Cl -4.186204 0.633868 -2.232181
Cl -1.020567 -3.005865 2.462548
P  2.258958 0.254066 0.133565
O  1.375597 -0.064114 1.449174
O  2.32047 -1.167882 -0.555916
O  1.323285 1.085304 -0.841263
O  3.526942 0.898607 0.528034
C  -0.848405 -0.519518 0.561712
C  0.271063 -0.8931 1.442341
C  3.338046 -1.500286 -1.533203
C  1.247364 2.530599 -0.789732
C  -1.517548 0.69368 0.701655
C  -1.240698 -1.369753 -0.467258
C  3.117959 -0.820929 -2.861743
C  2.173134 3.150907 -1.804818
C  -2.541847 1.062598 -0.15268
C  -2.267864 -1.030902 -1.33059
C  -2.907198 0.186278 -1.16208
C  0.310377 -1.941139 2.255023
H  4.319996 -1.259979 -1.123178
H  3.273725 -2.581195 -1.634788
H  0.208112 2.771137 -1.008899
H  1.465796 2.893504 0.215881
H  -0.723669 -2.310161 -0.603552
H  2.117311 -1.011614 -3.24905
H  3.277578 0.256348 -2.81281
H  3.835203 -1.2232 -3.57761
H  2.041389 4.233254 -1.790763
H  3.218652 2.939228 -1.582098
H  1.950824 2.801663 -2.813189
H  -3.049036 2.009291 -0.028438
H  -2.555548 -1.704788 -2.125335
H  1.179722 -2.172749 2.856284
elementType: Cl P O C H
totalener: -2488.78848689 hartree
nucrepener: 2320.32031408 hartree
electener: -4809.10880097 hartree
oneelecener: -8044.49787106 hartree
twoeener: 3235.38907009 hartree
cpcmener: -0.03047172 hartree
kineticenergy: 2482.71417261 hartree
xcener: -152.815132020732 hartree
chargesum: -0.0000000
charge: -0.065723 -0.076614 -0.073707 0.920017 -0.328635 -0.328947 -0.332865 -0.641679 0.061239 0.084403 0.029784 0.057064 0.003695 -0.160412 -0.246483 -0.268123 -0.108648 -0.140838 0.092674 -0.056347 0.103426 0.109555 0.102737 0.103174 0.159718 0.092189 0.085138 0.102267 0.105655 0.087983 0.091120 0.128382 0.150665 0.158138
qa: -0.0657 -0.0766 -0.0737 0.9200 -0.3286 -0.3289 -0.3329 -0.6417 0.0612 0.0844 0.0298 0.0571 0.0037 -0.1604 -0.2465 -0.2681 -0.1086 -0.1408 0.0927 -0.0563 0.1034 0.1096 0.1027 0.1032 0.1597 0.0922 0.0851 0.1023 0.1057 0.0880 0.0911 0.1284 0.1507 0.1581
va: 1.2585 1.2271 1.2452 5.5858 2.0973 2.0928 2.0481 1.9661 3.5115 3.8644 3.8495 3.8122 3.9187 3.9721 3.9165 3.9640 4.0103 4.0013 3.8743 4.0763 1.0030 0.9907 0.9887 0.9993 1.0009 1.0039 1.0044 1.0100 1.0086 1.0129 1.0012 1.0188 1.0018 0.9986
dispcorr: -0.021159462 hartree
energy: -2488.809646354585
dipole: 25.97306 -26.30890 -0.33584 5.90832 -6.38367 -0.47535 -21.40233 19.52866 -1.87367
magnitude: 1.96198 au
magnitude: 4.98696 debye
