program: Orca
programVersion: 5.0.4
elementType: Cl Cl Cl P O O O O C C C C C C C C C C C C H H H H H H H H H H H H H H
charge: 0
multiplicity: 1
keywords: wb97x-d3
keywords: def2-TZVPP
keywords: def2/J RIJCOSX
keywords: DEFGRID2
keywords: scfconv7
keywords: smallprint printgap noloewdin
keywords: NOSOSCF
formula: C12H14Cl3O4P
InChI: InChI=1/C12H14Cl3O4P/c1-3-17-20(16,18-4-2)19-12(8-13)10-6-5-9(14)7-11(10)15/h5-8H,3-4H2,1-2H3
34 atoms
Cl -0.66318 0.733208 2.585106
Cl -4.614943 1.614573 -0.919043
Cl -0.996541 -3.73323 0.947319
P  1.963022 0.38559 -0.331804
O  1.454935 -0.674869 0.780762
O  3.358364 0.799019 0.28722
O  2.357847 -0.569823 -1.527614
O  1.021627 1.483328 -0.636932
C  -0.936937 -0.678402 0.29625
C  0.292269 -1.405128 0.655398
C  3.442803 1.760143 1.370479
C  2.340505 -0.110728 -2.903199
C  -1.443492 0.342939 1.095542
C  -1.605782 -0.981944 -0.884972
C  3.56531 3.171512 0.855936
C  1.004097 -0.373887 -3.547582
C  -2.575982 1.052292 0.736861
C  -2.738924 -0.286902 -1.270311
C  -3.208442 0.728008 -0.453171
C  0.378638 -2.704901 0.910603
H  2.584285 1.656352 2.037333
H  4.329479 1.472329 1.931544
H  2.604525 0.946535 -2.954054
H  3.13175 -0.670987 -3.39706
H  -1.220598 -1.763216 -1.526921
H  4.416637 3.280581 0.185105
H  2.665431 3.497472 0.337073
H  3.720905 3.840416 1.702308
H  0.736848 -1.429282 -3.493855
H  0.208676 0.213976 -3.090125
H  1.059221 -0.097155 -4.600806
H  -2.956015 1.841636 1.370192
H  -3.238147 -0.53182 -2.197106
H  1.318271 -3.187608 1.145225
elementType: Cl P O C H
totalener: -2488.78797477 hartree
nucrepener: 2303.52439145 hartree
electener: -4792.31236623 hartree
oneelecener: -8011.93159225 hartree
twoeener: 3219.61922603 hartree
cpcmener: -0.02919378 hartree
kineticenergy: 2482.72008404 hartree
xcener: -152.815611585411 hartree
chargesum: -0.0000000
charge: -0.063565 -0.077416 -0.075454 0.957091 -0.318689 -0.363358 -0.354755 -0.627322 0.060268 0.088306 0.056031 0.052494 0.043904 -0.199561 -0.250935 -0.252013 -0.140432 -0.136276 0.101245 -0.066293 0.092646 0.108815 0.099931 0.107791 0.171699 0.089752 0.081231 0.098265 0.089313 0.079664 0.107877 0.131221 0.151021 0.157501
qa: -0.0636 -0.0774 -0.0755 0.9571 -0.3187 -0.3634 -0.3548 -0.6273 0.0603 0.0883 0.0560 0.0525 0.0439 -0.1996 -0.2509 -0.2520 -0.1404 -0.1363 0.1012 -0.0663 0.0926 0.1088 0.0999 0.1078 0.1717 0.0898 0.0812 0.0983 0.0893 0.0797 0.1079 0.1312 0.1510 0.1575
va: 1.2618 1.2256 1.2420 5.5853 2.1039 2.1139 2.1081 1.9228 3.4807 3.8631 3.8666 3.8486 3.9249 3.9486 3.9271 3.9199 4.0665 3.9922 3.8790 4.0547 1.0000 0.9927 0.9996 0.9943 0.9854 1.0037 1.0192 1.0073 1.0034 1.0118 1.0095 1.0183 1.0023 0.9995
dispcorr: -0.020284743 hartree
energy: -2488.808259517640
dipole: 25.61856 -24.39788 1.22068 10.16018 -10.48607 -0.32589 -15.33598 14.53721 -0.79877
magnitude: 1.49476 au
magnitude: 3.79937 debye
