program: Orca
programVersion: 5.0.4
elementType: Cl Cl Cl P O O O O C C C C C C C C C C C C H H H H H H H H H H H H H H
charge: 0
multiplicity: 1
keywords: wb97x-d3
keywords: def2-TZVPP
keywords: def2/J RIJCOSX
keywords: DEFGRID2
keywords: scfconv7
keywords: smallprint printgap noloewdin
keywords: NOSOSCF
formula: C12H14Cl3O4P
InChI: InChI=1/C12H14Cl3O4P/c1-3-17-20(16,18-4-2)19-12(8-13)10-6-5-9(14)7-11(10)15/h5-8H,3-4H2,1-2H3
34 atoms
Cl 0.057569 0.026743 2.803744
Cl -4.09594 2.565982 0.571532
Cl -1.517123 -3.649274 0.372569
P  1.894404 0.040805 -0.855654
O  1.474509 -1.107302 0.207815
O  1.657766 1.355777 -0.012199
O  3.469941 -0.096011 -0.86242
O  1.201667 -0.065438 -2.157962
C  -0.899114 -0.591698 0.355402
C  0.179162 -1.588723 0.244666
C  1.586761 2.650776 -0.660409
C  4.133725 -1.023852 -1.758102
C  -1.023526 0.226804 1.474751
C  -1.798954 -0.418604 -0.691477
C  0.156016 3.047118 -0.915798
C  4.541349 -0.339702 -3.037062
C  -2.009318 1.194663 1.55984
C  -2.792979 0.541713 -0.633373
C  -2.880813 1.343394 0.492875
C  0.021492 -2.904712 0.200411
H  2.069551 3.341882 0.027948
H  2.167533 2.649595 -1.584867
H  5.003034 -1.378686 -1.207839
H  3.495222 -1.886912 -1.955548
H  -1.713726 -1.040917 -1.571945
H  0.139051 4.047846 -1.348841
H  -0.33378 2.372469 -1.617799
H  -0.421422 3.074564 0.00803
H  3.677991 0.002061 -3.607439
H  5.192713 0.512281 -2.842652
H  5.092398 -1.046627 -3.658096
H  -2.090455 1.822355 2.436182
H  -3.478493 0.666727 -1.459491
H  0.852775 -3.587909 0.085961
elementType: Cl P O C H
totalener: -2488.78937684 hartree
nucrepener: 2317.65500169 hartree
electener: -4806.44437853 hartree
oneelecener: -8039.99970001 hartree
twoeener: 3233.55532148 hartree
cpcmener: -0.02864322 hartree
kineticenergy: 2482.72999416 hartree
xcener: -152.816717715996 hartree
chargesum: 0.0000000
charge: -0.060987 -0.077291 -0.075952 0.968765 -0.330041 -0.343532 -0.366754 -0.630715 0.039874 0.085316 0.051250 0.049579 0.044584 -0.159652 -0.267569 -0.249054 -0.134865 -0.152602 0.104419 -0.064004 0.106969 0.102923 0.106779 0.098587 0.160642 0.110147 0.084441 0.093527 0.081829 0.089653 0.098072 0.128030 0.148369 0.159261
qa: -0.0610 -0.0773 -0.0760 0.9688 -0.3300 -0.3435 -0.3668 -0.6307 0.0399 0.0853 0.0513 0.0496 0.0446 -0.1597 -0.2676 -0.2491 -0.1349 -0.1526 0.1044 -0.0640 0.1070 0.1029 0.1068 0.0986 0.1606 0.1101 0.0844 0.0935 0.0818 0.0897 0.0981 0.1280 0.1484 0.1593
va: 1.2640 1.2245 1.2411 5.5804 2.1035 2.1013 2.1149 1.9225 3.5286 3.8808 3.8560 3.8632 3.9198 3.9413 3.9286 3.9291 3.9942 3.9850 3.8319 4.0670 0.9950 0.9971 0.9936 0.9987 1.0027 1.0117 1.0112 0.9951 1.0172 1.0029 1.0076 1.0208 1.0036 0.9972
dispcorr: -0.021524788 hartree
energy: -2488.810901632263
dipole: 24.38724 -23.27468 1.11256 10.32998 -9.87345 0.45653 -21.52527 20.89030 -0.63497
magnitude: 1.35993 au
magnitude: 3.45666 debye
