program: Orca
programVersion: 5.0.4
elementType: Cl Cl Cl P O O O O C C C C C C C C C C C C H H H H H H H H H H H H H H
charge: 0
multiplicity: 1
keywords: wb97x-d3
keywords: def2-TZVPP
keywords: def2/J RIJCOSX
keywords: DEFGRID2
keywords: scfconv7
keywords: smallprint printgap noloewdin
keywords: NOSOSCF
formula: C12H14Cl3O4P
InChI: InChI=1/C12H14Cl3O4P/c1-3-17-20(16,18-4-2)19-12(8-13)10-6-5-9(14)7-11(10)15/h5-8H,3-4H2,1-2H3
34 atoms
Cl 0.299849 -2.319201 -0.976097
Cl -4.07959 0.355852 -2.510956
Cl -1.461368 -1.804153 3.296273
P  1.783652 1.180815 0.536511
O  1.464755 -0.266118 1.181868
O  3.336893 1.320998 0.77454
O  1.531208 0.876959 -0.998547
O  1.039065 2.323816 1.104152
C  -0.882597 -0.435153 0.555081
C  0.188899 -0.64394 1.545035
C  4.330637 0.274598 0.683942
C  1.46868 1.934832 -1.982787
C  -0.907972 -1.131347 -0.650462
C  -1.879199 0.505502 0.794201
C  4.382534 -0.425378 -0.652089
C  0.044911 2.367475 -2.222061
C  -1.890442 -0.905607 -1.598554
C  -2.873351 0.752294 -0.136226
C  -2.861868 0.045311 -1.327336
C  0.043457 -1.186653 2.746191
H  5.270885 0.786568 0.878244
H  4.164133 -0.436093 1.494238
H  2.094091 2.776919 -1.681087
H  1.904369 1.509155 -2.88444
H  -1.87107 1.060123 1.722533
H  5.2632 -1.06862 -0.657893
H  3.516084 -1.060764 -0.831056
H  4.483487 0.280488 -1.476751
H  -0.580662 1.527615 -2.523503
H  -0.39217 2.83448 -1.340319
H  0.030182 3.099532 -3.030327
H  -1.894443 -1.455475 -2.529401
H  -3.63556 1.491644 0.06446
H  0.864427 -1.284447 3.443814
elementType: Cl P O C H
totalener: -2488.78767116 hartree
nucrepener: 2340.50210095 hartree
electener: -4829.28977212 hartree
oneelecener: -8085.25686882 hartree
twoeener: 3255.96709670 hartree
cpcmener: -0.03076245 hartree
kineticenergy: 2482.72011427 hartree
xcener: -152.819491254993 hartree
chargesum: 0.0000000
charge: -0.062411 -0.077802 -0.075218 0.900008 -0.301532 -0.359224 -0.318897 -0.632042 0.008194 0.087542 0.050890 0.047602 0.066784 -0.147406 -0.255383 -0.264518 -0.132577 -0.147160 0.100359 -0.068313 0.110031 0.100047 0.107842 0.106563 0.159186 0.105550 0.082272 0.091193 0.091051 0.084082 0.109368 0.126559 0.147825 0.159537
qa: -0.0624 -0.0778 -0.0752 0.9000 -0.3015 -0.3592 -0.3189 -0.6320 0.0082 0.0875 0.0509 0.0476 0.0668 -0.1474 -0.2554 -0.2645 -0.1326 -0.1472 0.1004 -0.0683 0.1100 0.1000 0.1078 0.1066 0.1592 0.1055 0.0823 0.0912 0.0911 0.0841 0.1094 0.1266 0.1478 0.1595
va: 1.2621 1.2232 1.2420 5.5965 2.0841 2.1301 2.0556 1.9622 3.5401 3.8848 3.8422 3.8312 3.9040 3.9404 3.9147 3.9417 4.0080 3.9823 3.8366 4.0647 0.9869 0.9972 0.9968 0.9931 1.0021 1.0093 1.0114 1.0046 0.9954 1.0138 1.0121 1.0213 1.0033 0.9968
dispcorr: -0.022550911 hartree
energy: -2488.810222075535
dipole: 23.65476 -22.31064 1.34412 13.61722 -14.14465 -0.52743 -9.11462 7.95443 -1.16019
magnitude: 1.85226 au
magnitude: 4.70808 debye
