program: Orca
programVersion: 5.0.4
elementType: Cl Cl Cl P O O O O C C C C C C C C C C C C H H H H H H H H H H H H H H
charge: 0
multiplicity: 1
keywords: wb97x-d3
keywords: def2-TZVPP
keywords: def2/J RIJCOSX
keywords: DEFGRID2
keywords: scfconv7
keywords: smallprint printgap noloewdin
keywords: NOSOSCF
formula: C12H14Cl3O4P
InChI: InChI=1/C12H14Cl3O4P/c1-3-17-20(16,18-4-2)19-12(8-13)10-6-5-9(14)7-11(10)15/h5-8H,3-4H2,1-2H3
34 atoms
Cl -0.093427 -0.29586 2.367403
Cl -4.267347 2.407714 0.413984
Cl -0.976563 -3.4313 1.178495
P  2.156655 -0.088305 -1.094897
O  1.0373 -1.222683 -1.366209
O  1.355304 1.259135 -0.840682
O  2.664214 -0.516661 0.337232
O  3.136582 -0.057343 -2.196892
C  -0.989449 -0.625791 -0.17213
C  0.095851 -1.59189 -0.42271
C  1.25714 2.294348 -1.847329
C  3.852153 0.036648 0.947141
C  -1.158523 0.022062 1.048859
C  -1.860044 -0.304942 -1.210101
C  0.385097 1.906328 -3.016455
C  3.66338 1.456567 1.421741
C  -2.16795 0.952134 1.241312
C  -2.874826 0.620097 -1.045147
C  -3.014738 1.241654 0.185349
C  0.199381 -2.805806 0.098449
H  0.836564 3.149107 -1.321305
H  2.258948 2.569135 -2.179213
H  4.060308 -0.62487 1.7851
H  4.68599 -0.039545 0.247433
H  -1.741729 -0.791119 -2.169667
H  -0.633327 1.678985 -2.705099
H  0.340131 2.747813 -3.708787
H  0.783192 1.052918 -3.566849
H  4.537739 1.743856 2.005915
H  3.575076 2.166007 0.59915
H  2.787259 1.54987 2.063247
H  -2.282308 1.446565 2.195913
H  -3.540835 0.85215 -1.864293
H  1.013918 -3.477688 -0.139188
elementType: Cl P O C H
totalener: -2488.78668353 hartree
nucrepener: 2343.67319610 hartree
electener: -4832.45987963 hartree
oneelecener: -8091.42012782 hartree
twoeener: 3258.96024819 hartree
cpcmener: -0.03049320 hartree
kineticenergy: 2482.73055092 hartree
xcener: -152.820485079691 hartree
chargesum: -0.0000000
charge: -0.062644 -0.077727 -0.072008 0.916831 -0.338775 -0.340544 -0.319616 -0.641242 0.024791 0.117978 0.043439 0.018801 0.032262 -0.191951 -0.260533 -0.244185 -0.118137 -0.130132 0.091978 -0.045067 0.109797 0.106781 0.110070 0.104114 0.160687 0.093855 0.108448 0.091591 0.102944 0.087375 0.083572 0.127802 0.151147 0.158297
qa: -0.0626 -0.0777 -0.0720 0.9168 -0.3388 -0.3405 -0.3196 -0.6412 0.0248 0.1180 0.0434 0.0188 0.0323 -0.1920 -0.2605 -0.2442 -0.1181 -0.1301 0.0920 -0.0451 0.1098 0.1068 0.1101 0.1041 0.1607 0.0939 0.1084 0.0916 0.1029 0.0874 0.0836 0.1278 0.1511 0.1583
va: 1.2586 1.2261 1.2514 5.5901 2.0856 2.0496 2.1099 1.9714 3.5560 3.7886 3.8119 3.8594 3.9245 3.9076 3.9219 3.9134 4.0419 3.9379 3.8737 4.0837 0.9920 1.0044 0.9892 1.0025 0.9983 0.9990 1.0102 1.0170 1.0099 1.0075 1.0104 1.0190 1.0011 0.9977
dispcorr: -0.021738281 hartree
energy: -2488.808421809969
dipole: 21.14350 -21.35901 -0.21551 15.12530 -13.92946 1.19583 -12.59706 12.90804 0.31097
magnitude: 1.25426 au
magnitude: 3.18807 debye
