program: Orca
programVersion: 5.0.4
elementType: Cl Cl Cl P O O O O C C C C C C C C C C C C H H H H H H H H H H H H H H
charge: 0
multiplicity: 1
keywords: wb97x-d3
keywords: def2-TZVPP
keywords: def2/J RIJCOSX
keywords: DEFGRID2
keywords: scfconv7
keywords: smallprint printgap noloewdin
keywords: NOSOSCF
formula: C12H14Cl3O4P
InChI: InChI=1/C12H14Cl3O4P/c1-3-17-20(16,18-4-2)19-12(8-13)10-6-5-9(14)7-11(10)15/h5-8H,3-4H2,1-2H3
34 atoms
Cl -1.820213 2.014504 2.062953
Cl -5.168865 -0.482305 -1.272757
Cl -0.213977 -0.811816 3.14531
P  2.664653 0.194838 -0.542075
O  1.243268 0.859546 -0.12755
O  2.217676 -1.216943 -1.113624
O  3.058314 1.101699 -1.770222
O  3.705375 0.174915 0.500829
C  -0.987288 0.135396 0.290546
C  0.389562 0.296499 0.792719
C  2.873651 -2.457634 -0.766683
C  2.248776 1.274634 -2.954719
C  -2.063246 0.849535 0.813707
C  -1.23605 -0.743342 -0.76166
C  2.27531 -3.066302 0.474899
C  3.132416 1.811007 -4.050097
C  -3.352989 0.668951 0.338144
C  -2.51273 -0.940566 -1.254228
C  -3.562844 -0.235817 -0.687948
C  0.817051 -0.054167 2.000295
H  2.724649 -3.104253 -1.629789
H  3.946823 -2.298492 -0.65298
H  1.806997 0.321104 -3.250491
H  1.439899 1.970349 -2.726702
H  -0.416436 -1.298997 -1.196818
H  1.200236 -3.215854 0.370635
H  2.732128 -4.041785 0.648148
H  2.45961 -2.454274 1.357874
H  3.574424 2.769817 -3.778247
H  3.932826 1.113482 -4.297409
H  2.532492 1.963644 -4.947632
H  -4.175935 1.228153 0.761501
H  -2.683046 -1.639388 -2.061312
H  1.826594 0.115373 2.348698
elementType: Cl P O C H
totalener: -2488.80068687 hartree
nucrepener: 2255.56090015 hartree
electener: -4744.36158702 hartree
oneelecener: -7914.40253318 hartree
twoeener: 3170.04094617 hartree
cpcmener: -0.02460582 hartree
kineticenergy: 2482.69895511 hartree
xcener: -152.812307321430 hartree
chargesum: 0.0000000
charge: -0.057167 -0.076570 -0.078113 0.898016 -0.326447 -0.337330 -0.342315 -0.605422 0.059418 0.128172 0.046363 0.041459 0.003623 -0.166054 -0.253935 -0.240703 -0.117440 -0.158287 0.089877 -0.057118 0.108050 0.103597 0.102760 0.102446 0.156340 0.087449 0.108777 0.086452 0.089964 0.087551 0.087627 0.126181 0.145471 0.157307
qa: -0.0572 -0.0766 -0.0781 0.8980 -0.3264 -0.3373 -0.3423 -0.6054 0.0594 0.1282 0.0464 0.0415 0.0036 -0.1661 -0.2539 -0.2407 -0.1174 -0.1583 0.0899 -0.0571 0.1080 0.1036 0.1028 0.1024 0.1563 0.0874 0.1088 0.0865 0.0900 0.0876 0.0876 0.1262 0.1455 0.1573
va: 1.2653 1.2265 1.2360 5.6299 2.0939 2.0620 2.1379 2.0030 3.5435 3.8048 3.8284 3.8404 3.9748 3.9240 3.9194 3.9656 4.0293 4.0483 3.8772 4.0057 0.9939 1.0052 0.9918 0.9933 1.0080 1.0032 1.0114 1.0085 1.0037 1.0055 1.0062 1.0199 1.0058 1.0145
dispcorr: -0.019323618 hartree
energy: -2488.820010484447
dipole: 27.32227 -27.79464 -0.47237 -9.35437 8.08690 -1.26747 -22.57622 20.39619 -2.18003
magnitude: 2.56557 au
magnitude: 6.52116 debye
