program: Orca
programVersion: 5.0.4
elementType: Cl Cl Cl P O O O O C C C C C C C C C C C C H H H H H H H H H H H H H H
charge: 0
multiplicity: 1
keywords: wb97x-d3
keywords: def2-TZVPP
keywords: def2/J RIJCOSX
keywords: DEFGRID2
keywords: scfconv7
keywords: smallprint printgap noloewdin
keywords: NOSOSCF
formula: C12H14Cl3O4P
InChI: InChI=1/C12H14Cl3O4P/c1-3-17-20(16,18-4-2)19-12(8-13)10-6-5-9(14)7-11(10)15/h5-8H,3-4H2,1-2H3
34 atoms
Cl -1.619191 -1.238906 2.679702
Cl -4.838192 2.495623 0.613352
Cl -1.270446 -3.112178 -0.242869
P  2.311734 0.047698 -0.923128
O  1.255028 -0.123532 0.292646
O  3.14557 1.294882 -0.420517
O  3.306209 -1.156002 -0.665077
O  1.699887 0.132373 -2.263924
C  -1.134254 -0.049916 0.290572
C  0.094547 -0.855278 0.162519
C  2.603578 2.633731 -0.437633
C  4.167544 -1.672186 -1.704843
C  -1.983106 -0.151524 1.390426
C  -1.452815 0.8755 -0.700724
C  3.751656 3.607614 -0.382077
C  5.280317 -0.717935 -2.064417
C  -3.125035 0.627271 1.498423
C  -2.587183 1.662165 -0.617643
C  -3.413471 1.527723 0.487584
C  0.146544 -2.163745 -0.050561
H  2.01034 2.786086 -1.341879
H  1.944522 2.754429 0.425535
H  4.568683 -2.596809 -1.293167
H  3.567376 -1.929151 -2.579426
H  -0.805528 0.974901 -1.562706
H  3.357001 4.624309 -0.362617
H  4.354257 3.467376 0.515834
H  4.398159 3.514479 -1.255594
H  5.966565 -1.220901 -2.746637
H  4.913739 0.174842 -2.572109
H  5.848662 -0.413773 -1.185484
H  -3.772639 0.534489 2.359609
H  -2.820483 2.365241 -1.405094
H  1.072972 -2.719128 -0.113839
elementType: Cl P O C H
totalener: -2488.80098202 hartree
nucrepener: 2223.57946669 hartree
electener: -4712.38044871 hartree
oneelecener: -7851.16961002 hartree
twoeener: 3138.78916131 hartree
cpcmener: -0.02282256 hartree
kineticenergy: 2482.69658481 hartree
xcener: -152.808194045684 hartree
chargesum: -0.0000000
charge: -0.058897 -0.076928 -0.072185 0.939205 -0.338774 -0.340799 -0.356850 -0.605767 0.040574 0.119125 0.040032 0.036026 0.011530 -0.152029 -0.241204 -0.249154 -0.119401 -0.152401 0.087645 -0.037620 0.098897 0.106021 0.105845 0.100946 0.150403 0.088670 0.089127 0.087494 0.098597 0.088349 0.091412 0.125895 0.145749 0.150465
qa: -0.0589 -0.0769 -0.0722 0.9392 -0.3388 -0.3408 -0.3568 -0.6058 0.0406 0.1191 0.0400 0.0360 0.0115 -0.1520 -0.2412 -0.2492 -0.1194 -0.1524 0.0876 -0.0376 0.0989 0.1060 0.1058 0.1009 0.1504 0.0887 0.0891 0.0875 0.0986 0.0883 0.0914 0.1259 0.1457 0.1505
va: 1.2629 1.2262 1.2466 5.6029 2.1075 2.1182 2.1187 1.9656 3.6039 3.8339 3.8376 3.8589 3.9741 3.9200 3.9582 3.9162 4.0332 4.0282 3.8822 4.0694 0.9948 0.9925 0.9904 1.0008 1.0212 1.0069 1.0033 1.0050 1.0086 1.0115 1.0055 1.0197 1.0052 1.0066
dispcorr: -0.017938899 hartree
energy: -2488.818920916823
dipole: 40.65226 -39.11711 1.53515 13.67328 -12.89641 0.77687 -15.43350 15.23935 -0.19415
magnitude: 1.73144 au
magnitude: 4.40098 debye
