program: Orca
programVersion: 5.0.4
elementType: Cl Cl Cl P O O O O C C C C C C C C C C C C H H H H H H H H H H H H H H
charge: 0
multiplicity: 1
keywords: wb97x-d3
keywords: def2-TZVPP
keywords: def2/J RIJCOSX
keywords: DEFGRID2
keywords: scfconv7
keywords: smallprint printgap noloewdin
keywords: NOSOSCF
formula: C12H14Cl3O4P
InChI: InChI=1/C12H14Cl3O4P/c1-3-17-20(16,18-4-2)19-12(8-13)10-6-5-9(14)7-11(10)15/h5-8H,3-4H2,1-2H3
34 atoms
Cl -2.099988 1.634089 2.263826
Cl -5.149231 -0.331157 -1.66247
Cl -0.539773 -1.294097 3.060392
P  2.642371 0.318346 -0.120149
O  1.119344 0.803965 0.144827
O  2.384153 -1.136977 -0.698873
O  3.057536 1.277378 -1.301465
O  3.576281 0.41905 1.014004
C  -1.115238 0.030623 0.310114
C  0.218985 0.122289 0.928676
C  3.391196 -2.170804 -0.657927
C  2.361523 1.368771 -2.562296
C  -2.23469 0.664107 0.844432
C  -1.27075 -0.690484 -0.87164
C  4.494159 -1.934209 -1.659676
C  3.366002 1.679132 -3.640837
C  -3.480414 0.556984 0.245593
C  -2.501729 -0.810082 -1.489286
C  -3.599052 -0.18715 -0.915371
C  0.563011 -0.388976 2.105148
H  3.785773 -2.255587 0.355977
H  2.852862 -3.089952 -0.882847
H  1.839503 0.436247 -2.784951
H  1.615384 2.160385 -2.479936
H  -0.413059 -1.183804 -1.310114
H  5.09098 -1.053901 -1.416199
H  5.165616 -2.793734 -1.657043
H  4.100005 -1.824041 -2.670408
H  2.846791 1.785595 -4.593663
H  3.892751 2.613186 -3.44287
H  4.100463 0.8800 -3.745937
H  -4.33972 1.050495 0.678184
H  -2.601433 -1.383458 -2.400444
H  1.546658 -0.277924 2.541746
elementType: Cl P O C H
totalener: -2488.80083427 hartree
nucrepener: 2235.94752912 hartree
electener: -4724.74836338 hartree
oneelecener: -7875.23996038 hartree
twoeener: 3150.49159700 hartree
cpcmener: -0.02571496 hartree
kineticenergy: 2482.70927259 hartree
xcener: -152.813452258247 hartree
chargesum: 0.0000000
charge: -0.056844 -0.076370 -0.075590 0.877848 -0.322588 -0.321794 -0.337999 -0.601948 0.037975 0.129346 0.046875 0.029343 0.012036 -0.154625 -0.257379 -0.237379 -0.119041 -0.155742 0.090797 -0.044166 0.101015 0.101365 0.103665 0.110641 0.152210 0.092748 0.104486 0.088611 0.090693 0.091510 0.084730 0.125992 0.146177 0.143401
qa: -0.0568 -0.0764 -0.0756 0.8778 -0.3226 -0.3218 -0.3380 -0.6019 0.0380 0.1293 0.0469 0.0293 0.0120 -0.1546 -0.2574 -0.2374 -0.1190 -0.1557 0.0908 -0.0442 0.1010 0.1014 0.1037 0.1106 0.1522 0.0927 0.1045 0.0886 0.0907 0.0915 0.0847 0.1260 0.1462 0.1434
va: 1.2653 1.2267 1.2417 5.6305 2.1161 2.0613 2.1074 2.0091 3.5822 3.8208 3.8447 3.8379 3.9659 3.9418 3.9184 3.9526 4.0319 4.0221 3.8787 4.0272 1.0059 0.9909 0.9928 0.9957 1.0067 1.0098 1.0108 1.0020 1.0068 1.0035 1.0053 1.0201 1.0054 1.0225
dispcorr: -0.018611181 hartree
energy: -2488.819445448674
dipole: 35.90500 -35.81619 0.08881 -5.04259 3.84138 -1.20121 -27.16106 24.51153 -2.64953
magnitude: 2.91046 au
magnitude: 7.39781 debye
