program: Orca
programVersion: 5.0.4
elementType: Cl Cl Cl P O O O O C C C C C C C C C C C C H H H H H H H H H H H H H H
charge: 0
multiplicity: 1
keywords: wb97x-d3
keywords: def2-TZVPP
keywords: def2/J RIJCOSX
keywords: DEFGRID2
keywords: scfconv7
keywords: smallprint printgap noloewdin
keywords: NOSOSCF
formula: C12H14Cl3O4P
InChI: InChI=1/C12H14Cl3O4P/c1-3-17-20(16,18-4-2)19-12(8-13)10-6-5-9(14)7-11(10)15/h5-8H,3-4H2,1-2H3
34 atoms
Cl 0.128898 -0.608212 2.162735
Cl -3.785164 2.862437 1.064999
Cl -1.181996 -3.36407 0.569478
P  2.099079 0.017115 -1.473345
O  0.861527 -0.977288 -1.78283
O  1.487028 1.33865 -0.842193
O  2.756053 -0.688459 -0.221115
O  2.900031 0.193929 -2.696537
C  -0.960561 -0.368975 -0.308443
C  -0.026789 -1.392552 -0.813827
C  0.977109 2.398212 -1.6817
C  3.671927 -0.000464 0.661153
C  -0.974677 0.057698 1.01665
C  -1.838685 0.241233 -1.201018
C  0.43122 3.481498 -0.791745
C  4.279967 -1.014984 1.591726
C  -1.84917 1.040545 1.452829
C  -2.719584 1.225933 -0.792737
C  -2.713999 1.61503 0.537158
C  -0.032119 -2.682154 -0.50525
H  1.784708 2.778771 -2.309013
H  0.195915 2.003637 -2.335132
H  4.444692 0.498664 0.072525
H  3.123789 0.758612 1.220597
H  -1.83871 -0.067387 -2.238518
H  0.035031 4.285072 -1.413215
H  -0.379772 3.116821 -0.16153
H  1.206905 3.905519 -0.153536
H  3.518376 -1.518287 2.188341
H  4.854943 -1.766048 1.049882
H  4.957504 -0.50449 2.277093
H  -1.84223 1.361179 2.485451
H  -3.395355 1.681245 -1.503243
H  0.673738 -3.384514 -0.92969
elementType: Cl P O C H
totalener: -2488.80125913 hartree
nucrepener: 2345.73477119 hartree
electener: -4834.53603032 hartree
oneelecener: -8094.79309716 hartree
twoeener: 3260.25706684 hartree
cpcmener: -0.02674402 hartree
kineticenergy: 2482.72006622 hartree
xcener: -152.815080501237 hartree
chargesum: -0.0000000
charge: -0.062517 -0.078456 -0.070294 0.883781 -0.331778 -0.318667 -0.321548 -0.613720 0.011809 0.098936 -0.000866 0.014791 0.045112 -0.123964 -0.247528 -0.234452 -0.123347 -0.168598 0.105254 -0.048919 0.125035 0.118406 0.118676 0.102917 0.154394 0.096409 0.079990 0.097057 0.083740 0.090848 0.089339 0.126738 0.146205 0.155218
qa: -0.0625 -0.0785 -0.0703 0.8838 -0.3318 -0.3187 -0.3215 -0.6137 0.0118 0.0989 -0.0009 0.0148 0.0451 -0.1240 -0.2475 -0.2345 -0.1233 -0.1686 0.1053 -0.0489 0.1250 0.1184 0.1187 0.1029 0.1544 0.0964 0.0800 0.0971 0.0837 0.0908 0.0893 0.1267 0.1462 0.1552
va: 1.2598 1.2227 1.2527 5.6306 2.0917 2.0584 2.0951 2.0165 3.5723 3.8103 3.8335 3.8397 3.9156 3.8467 3.9492 3.9533 4.0249 3.9759 3.8425 4.0739 1.0046 0.9841 0.9947 0.9970 1.0001 1.0080 1.0028 1.0056 1.0053 1.0042 1.0072 1.0208 1.0041 0.9987
dispcorr: -0.022175520 hartree
energy: -2488.823434652780
dipole: 20.59142 -21.03301 -0.44159 13.17393 -12.03084 1.14309 -5.23971 6.06900 0.82928
magnitude: 1.47965 au
magnitude: 3.76097 debye
