program: Orca
programVersion: 5.0.4
elementType: Cl Cl Cl P O O O O C C C C C C C C C C C C H H H H H H H H H H H H H H
charge: 0
multiplicity: 1
keywords: wb97x-d3
keywords: def2-TZVPP
keywords: def2/J RIJCOSX
keywords: DEFGRID2
keywords: scfconv7
keywords: smallprint printgap noloewdin
keywords: NOSOSCF
formula: C12H14Cl3O4P
InChI: InChI=1/C12H14Cl3O4P/c1-3-17-20(16,18-4-2)19-12(8-13)10-6-5-9(14)7-11(10)15/h5-8H,3-4H2,1-2H3
34 atoms
Cl -1.03941 0.830464 2.444599
Cl -4.514228 1.005622 -1.613124
Cl -0.84058 -2.627474 2.646212
P  2.009973 0.41421 -0.616435
O  1.655188 -0.982362 0.120752
O  3.590155 0.452183 -0.484059
O  1.797323 -0.018033 -2.124587
O  1.286205 1.600545 -0.123115
C  -0.763046 -0.687156 0.215534
C  0.478413 -1.252578 0.774542
C  4.232961 1.148765 0.607851
C  1.889852 0.959372 -3.186993
C  -1.525892 0.261487 0.892859
C  -1.183354 -1.08917 -1.049134
C  3.994291 0.50003 1.950457
C  0.532449 1.5153 -3.532167
C  -2.682073 0.785731 0.339103
C  -2.332226 -0.577134 -1.625189
C  -3.072437 0.356427 -0.918481
C  0.555269 -2.078205 1.81099
H  5.292008 1.131594 0.356552
H  3.908957 2.190746 0.612119
H  2.586351 1.756166 -2.916549
H  2.321524 0.423809 -4.030932
H  -0.60744 -1.828289 -1.590558
H  4.602938 1.013778 2.695857
H  2.955313 0.576869 2.274668
H  4.286969 -0.549934 1.950101
H  -0.154409 0.729469 -3.845954
H  0.089955 2.052973 -2.694233
H  0.63674 2.216205 -4.361187
H  -3.263123 1.520927 0.878376
H  -2.643583 -0.908206 -2.605957
H  1.494596 -2.474021 2.174577
elementType: Cl P O C H
totalener: -2488.79923012 hartree
nucrepener: 2316.37262047 hartree
electener: -4805.17185058 hartree
oneelecener: -8037.53536237 hartree
twoeener: 3232.36351179 hartree
cpcmener: -0.02429843 hartree
kineticenergy: 2482.71818724 hartree
xcener: -152.815680088462 hartree
chargesum: -0.0000000
charge: -0.058680 -0.076537 -0.076738 0.929647 -0.314223 -0.360620 -0.348683 -0.592630 0.023951 0.128509 0.036178 0.050032 0.022385 -0.159493 -0.246507 -0.256502 -0.112896 -0.155681 0.095252 -0.062200 0.105632 0.099579 0.097446 0.104977 0.154901 0.100438 0.081835 0.090673 0.085568 0.085250 0.105989 0.123938 0.146891 0.152319
qa: -0.0587 -0.0765 -0.0767 0.9296 -0.3142 -0.3606 -0.3487 -0.5926 0.0240 0.1285 0.0362 0.0500 0.0224 -0.1595 -0.2465 -0.2565 -0.1129 -0.1557 0.0953 -0.0622 0.1056 0.0996 0.0974 0.1050 0.1549 0.1004 0.0818 0.0907 0.0856 0.0853 0.1060 0.1239 0.1469 0.1523
va: 1.2612 1.2270 1.2449 5.6055 2.1176 2.1151 2.1030 1.9726 3.5461 3.8313 3.8666 3.8668 3.9384 3.9075 3.9048 3.9190 4.0408 3.9675 3.8691 4.0258 0.9914 1.0015 0.9995 0.9928 1.0057 1.0095 1.0137 1.0063 1.0017 1.0157 1.0099 1.0201 1.0032 1.0001
dispcorr: -0.020776458 hartree
energy: -2488.820006574995
dipole: 27.27119 -25.75271 1.51847 7.89861 -8.05203 -0.15343 -14.72294 13.57296 -1.14998
magnitude: 1.91096 au
magnitude: 4.85727 debye
