program: Orca
programVersion: 5.0.4
elementType: Cl Cl Cl P O O O O C C C C C C C C C C C C H H H H H H H H H H H H H H
charge: 0
multiplicity: 1
keywords: wb97x-d3
keywords: def2-TZVPP
keywords: def2/J RIJCOSX
keywords: DEFGRID2
keywords: scfconv7
keywords: smallprint printgap noloewdin
keywords: NOSOSCF
formula: C12H14Cl3O4P
InChI: InChI=1/C12H14Cl3O4P/c1-3-17-20(16,18-4-2)19-12(8-13)10-6-5-9(14)7-11(10)15/h5-8H,3-4H2,1-2H3
34 atoms
Cl -0.031565 -0.164295 2.822591
Cl -4.314811 2.518868 1.045016
Cl -1.519945 -3.479693 -0.136638
P  1.945904 -0.0929 -1.278641
O  1.38089 -0.824063 0.061502
O  1.314972 1.354349 -1.305856
O  3.444988 0.166502 -0.850073
O  1.660936 -0.853324 -2.508349
C  -0.988155 -0.427268 0.309574
C  0.115157 -1.369091 0.048333
C  1.430964 2.303745 -0.221542
C  4.416302 -0.897636 -0.71642
C  -1.131536 0.203026 1.542448
C  -1.900743 -0.120013 -0.694825
C  0.296699 3.287046 -0.331625
C  5.144552 -1.145049 -2.01222
C  -2.150552 1.109168 1.782715
C  -2.930977 0.779715 -0.482361
C  -3.042334 1.386117 0.758695
C  -0.006642 -2.668421 -0.18871
H  1.400246 1.788558 0.740716
H  2.395691 2.806472 -0.3056
H  5.101433 -0.557294 0.058746
H  3.935299 -1.808202 -0.3527
H  -1.797519 -0.588233 -1.665073
H  -0.672396 2.795177 -0.245228
H  0.375888 4.012992 0.478317
H  0.328422 3.834686 -1.27376
H  5.932282 -1.880734 -1.840311
H  4.483127 -1.540253 -2.783431
H  5.615637 -0.235285 -2.385766
H  -2.248945 1.583265 2.749759
H  -3.628195 1.006562 -1.276993
H  0.843968 -3.301245 -0.407044
elementType: Cl P O C H
totalener: -2488.80262648 hartree
nucrepener: 2296.45859779 hartree
electener: -4785.26122426 hartree
oneelecener: -7996.49536486 hartree
twoeener: 3211.23414060 hartree
cpcmener: -0.02600462 hartree
kineticenergy: 2482.69784841 hartree
xcener: -152.808804961987 hartree
chargesum: 0.0000000
charge: -0.063699 -0.077180 -0.072226 0.915296 -0.335052 -0.343109 -0.339689 -0.608712 0.013477 0.097173 0.009966 0.049967 0.061627 -0.138005 -0.236712 -0.243092 -0.160387 -0.128070 0.108689 -0.054522 0.111489 0.121321 0.104838 0.097441 0.157484 0.067740 0.094793 0.099108 0.094793 0.082373 0.087994 0.124956 0.146039 0.153891
qa: -0.0637 -0.0772 -0.0722 0.9153 -0.3351 -0.3431 -0.3397 -0.6087 0.0135 0.0972 0.0100 0.0500 0.0616 -0.1380 -0.2367 -0.2431 -0.1604 -0.1281 0.1087 -0.0545 0.1115 0.1213 0.1048 0.0974 0.1575 0.0677 0.0948 0.0991 0.0948 0.0824 0.0880 0.1250 0.1460 0.1539
va: 1.2585 1.2245 1.2457 5.6205 2.0491 2.1078 2.1141 2.0037 3.5725 3.8622 3.8347 3.8611 3.8945 3.9238 3.9395 3.9266 4.0649 3.9672 3.8398 4.1181 0.9941 0.9993 0.9915 0.9976 1.0022 1.0093 1.0080 1.0069 1.0079 1.0171 1.0041 1.0219 1.0038 0.9968
dispcorr: -0.021211872 hartree
energy: -2488.823838347738
dipole: 27.17269 -26.09930 1.07339 9.20122 -8.45554 0.74568 -12.09931 13.19650 1.09720
magnitude: 1.70647 au
magnitude: 4.33750 debye
