program: Orca
programVersion: 5.0.4
elementType: Cl Cl Cl P O O O O C C C C C C C C C C C C H H H H H H H H H H H H H H
charge: 0
multiplicity: 1
keywords: wb97x-d3
keywords: def2-TZVPP
keywords: def2/J RIJCOSX
keywords: DEFGRID2
keywords: scfconv7
keywords: smallprint printgap noloewdin
keywords: NOSOSCF
formula: C12H14Cl3O4P
InChI: InChI=1/C12H14Cl3O4P/c1-3-17-20(16,18-4-2)19-12(8-13)10-6-5-9(14)7-11(10)15/h5-8H,3-4H2,1-2H3
34 atoms
Cl -0.1613 -0.381119 2.735413
Cl -4.489699 2.337168 1.123787
Cl -1.382703 -3.414769 -0.517643
P  1.949699 0.137897 -1.418106
O  1.348897 -0.607382 -0.09996
O  1.410606 1.619572 -1.385204
O  3.476543 0.288921 -1.028962
O  1.632098 -0.555953 -2.678764
C  -1.038999 -0.397586 0.181318
C  0.124146 -1.238153 -0.155416
C  1.135259 2.441783 -0.231159
C  4.451606 -0.753169 -1.254573
C  -1.244147 0.08074 1.472635
C  -1.932381 -0.012867 -0.812757
C  2.300225 2.624119 0.709665
C  4.422053 -1.81539 -0.184042
C  -2.302547 0.919957 1.77678
C  -2.99957 0.82425 -0.5366
C  -3.169913 1.28427 0.759249
C  0.082008 -2.518589 -0.496181
H  0.838143 3.399828 -0.654072
H  0.27088 2.033838 0.293748
H  4.30469 -1.185067 -2.24605
H  5.410005 -0.236557 -1.256747
H  -1.781614 -0.365065 -1.82502
H  3.181844 3.011812 0.199869
H  2.006695 3.354557 1.465059
H  2.567072 1.7074 1.234616
H  4.509429 -1.381755 0.812541
H  3.518872 -2.42407 -0.223235
H  5.271857 -2.483003 -0.331967
H  -2.447749 1.279581 2.786182
H  -3.680771 1.116205 -1.323665
H  0.965868 -3.083262 -0.763371
elementType: Cl P O C H
totalener: -2488.79879999 hartree
nucrepener: 2299.94599909 hartree
electener: -4788.74479908 hartree
oneelecener: -8003.38468639 hartree
twoeener: 3214.63988731 hartree
cpcmener: -0.02632291 hartree
kineticenergy: 2482.70023514 hartree
xcener: -152.811928563352 hartree
chargesum: -0.0000000
charge: -0.061673 -0.075380 -0.072474 0.890120 -0.330585 -0.344622 -0.332988 -0.605959 -0.014962 0.107817 0.043486 0.040476 0.058323 -0.135556 -0.250085 -0.240487 -0.123659 -0.131523 0.088088 -0.041989 0.114884 0.086296 0.095813 0.106522 0.156836 0.096270 0.101489 0.082005 0.089988 0.080061 0.098340 0.126953 0.147958 0.150217
qa: -0.0617 -0.0754 -0.0725 0.8901 -0.3306 -0.3446 -0.3330 -0.6060 -0.0150 0.1078 0.0435 0.0405 0.0583 -0.1356 -0.2501 -0.2405 -0.1237 -0.1315 0.0881 -0.0420 0.1149 0.0863 0.0958 0.1065 0.1568 0.0963 0.1015 0.0820 0.0900 0.0801 0.0983 0.1270 0.1480 0.1502
va: 1.2625 1.2271 1.2456 5.6235 2.0323 2.1093 2.1075 2.0070 3.5944 3.8463 3.8602 3.8515 3.8879 3.9191 3.9180 3.9202 4.0403 3.9852 3.8819 4.1098 0.9901 0.9977 1.0057 0.9900 1.0033 1.0070 1.0077 1.0139 1.0050 1.0081 1.0098 1.0201 1.0027 0.9969
dispcorr: -0.021271382 hartree
energy: -2488.820071369105
dipole: 29.97170 -29.04822 0.92348 6.60637 -5.96803 0.63834 -5.11434 6.23437 1.12004
magnitude: 1.58580 au
magnitude: 4.03079 debye
