program: Orca
programVersion: 5.0.4
elementType: Cl Cl Cl P O O O O C C C C C C C C C C C C H H H H H H H H H H H H H H
charge: 0
multiplicity: 1
keywords: wb97x-d3
keywords: def2-TZVPP
keywords: def2/J RIJCOSX
keywords: DEFGRID2
keywords: scfconv7
keywords: smallprint printgap noloewdin
keywords: NOSOSCF
formula: C12H14Cl3O4P
InChI: InChI=1/C12H14Cl3O4P/c1-3-17-20(16,18-4-2)19-12(8-13)10-6-5-9(14)7-11(10)15/h5-8H,3-4H2,1-2H3
34 atoms
Cl -0.041448 -0.195189 2.674965
Cl -4.44544 2.317986 0.944534
Cl -1.269054 -3.511403 -0.254276
P  1.922126 0.270609 -1.370429
O  1.422152 -0.646846 -0.122931
O  2.640345 1.470712 -0.629904
O  3.120343 -0.50143 -2.045793
O  0.84675 0.554175 -2.335708
C  -0.971548 -0.435672 0.148514
C  0.20123 -1.282674 -0.138902
C  2.017063 2.285284 0.386286
C  4.433459 -0.719924 -1.492581
C  -1.1504 0.153401 1.39629
C  -1.908978 -0.167292 -0.843898
C  0.792755 3.026971 -0.094177
C  4.44161 -1.646224 -0.301269
C  -2.214981 1.000026 1.656826
C  -2.984866 0.670317 -0.610649
C  -3.119478 1.253849 0.638996
C  0.177639 -2.591367 -0.351363
H  1.788302 1.662929 1.252639
H  2.793892 2.98786 0.683087
H  5.000254 -1.15547 -2.313833
H  4.890589 0.240285 -1.249455
H  -1.790488 -0.616809 -1.820299
H  1.008902 3.626517 -0.978557
H  -0.045106 2.366844 -0.317128
H  0.470088 3.7048 0.697009
H  3.940203 -2.588999 -0.521377
H  5.478257 -1.873747 -0.050059
H  3.983964 -1.201481 0.581656
H  -2.337632 1.446729 2.633718
H  -3.699841 0.869973 -1.396673
H  1.070517 -3.163125 -0.569903
elementType: Cl P O C H
totalener: -2488.79873571 hartree
nucrepener: 2311.82771395 hartree
electener: -4800.62644966 hartree
oneelecener: -8027.49734353 hartree
twoeener: 3226.87089387 hartree
cpcmener: -0.02535692 hartree
kineticenergy: 2482.70983776 hartree
xcener: -152.815941111960 hartree
chargesum: -0.0000000
charge: -0.067976 -0.076793 -0.073786 0.898725 -0.333043 -0.332673 -0.346975 -0.604125 0.052581 0.114628 0.023091 0.043060 0.019510 -0.146022 -0.239793 -0.257904 -0.131170 -0.128817 0.090642 -0.054780 0.104580 0.113450 0.106197 0.098730 0.151904 0.105882 0.063130 0.100585 0.089305 0.102643 0.089204 0.127408 0.146560 0.152040
qa: -0.0680 -0.0768 -0.0738 0.8987 -0.3330 -0.3327 -0.3470 -0.6041 0.0526 0.1146 0.0231 0.0431 0.0195 -0.1460 -0.2398 -0.2579 -0.1312 -0.1288 0.0906 -0.0548 0.1046 0.1134 0.1062 0.0987 0.1519 0.1059 0.0631 0.1006 0.0893 0.1026 0.0892 0.1274 0.1466 0.1520
va: 1.2535 1.2259 1.2437 5.6097 2.0312 2.0930 2.1410 1.9967 3.5177 3.8416 3.8472 3.8592 3.9239 3.9288 3.9181 3.9195 4.0359 3.9885 3.8780 4.1004 1.0068 0.9907 0.9888 0.9990 1.0103 1.0081 1.0106 1.0089 1.0045 1.0098 1.0079 1.0194 1.0032 0.9986
dispcorr: -0.021903409 hartree
energy: -2488.820639118692
dipole: 27.21042 -25.60585 1.60457 7.59488 -7.43088 0.16400 -6.43834 7.58737 1.14903
magnitude: 1.98036 au
magnitude: 5.03367 debye
